<?xml version="1.0" encoding="UTF-8" standalone="yes" ?>
<!DOCTYPE bugzilla SYSTEM "https://bugzilla.yoctoproject.org/page.cgi?id=bugzilla.dtd">

<bugzilla version="5.0.6"
          urlbase="https://bugzilla.yoctoproject.org/"
          
          maintainer="it-coreprojects-helpdesk@linuxfoundation.org"
>

    <bug>
          <bug_id>1526</bug_id>
          
          <creation_ts>2011-09-26 15:31:21 +0000</creation_ts>
          <short_desc>Intel DPDK layer build for yocto</short_desc>
          <delta_ts>2014-03-06 22:33:28 +0000</delta_ts>
          <reporter_accessible>1</reporter_accessible>
          <cclist_accessible>1</cclist_accessible>
          <classification_id>7</classification_id>
          <classification>Build System, Metadata &amp; Runtime</classification>
          <product>Other YP Layers</product>
          <component>layers</component>
          <version>unspecified</version>
          <rep_platform>x86</rep_platform>
          <op_sys>x86_64</op_sys>
          <bug_status>RESOLVED</bug_status>
          <resolution>OBSOLETE</resolution>
          
          
          <bug_file_loc></bug_file_loc>
          <status_whiteboard>No estimate yet - wind river has volunteered to help with this, let&apos;s let kishore and wind river decide on a priority and time estimate for this</status_whiteboard>
          <keywords></keywords>
          <priority>Medium</priority>
          <bug_severity>normal</bug_severity>
          <target_milestone>1.4</target_milestone>
          
          
          <everconfirmed>1</everconfirmed>
          <reporter name="kishore">kishore.k.bodke</reporter>
          <assigned_to name="Nitin Kamble">nitin.a.kamble</assigned_to>
          <cc>bluelightning</cc>
    
    <cc>dvhart</cc>
    
    <cc>jessica.zhang</cc>
    
    <cc>meta.layer.watcher</cc>
    
    <cc>meta.watcher</cc>
    
    <cc>nitin.a.kamble</cc>
    
    <cc>poky.adt.watcher</cc>
    
    <cc>poky.watcher</cc>
    
    <cc>sgw</cc>
    
    <cc>tom.zanussi</cc>
          
          
          <cf_os>---</cf_os>
          <cf_regression_type>---</cf_regression_type>
          
          <cf_docchange>No (bug/feature does not impact docs)</cf_docchange>

      

      

      

          <comment_sort_order>oldest_to_newest</comment_sort_order>  
          <long_desc isprivate="0" >
    <commentid>16487</commentid>
    <comment_count>0</comment_count>
    <who name="kishore">kishore.k.bodke</who>
    <bug_when>2011-09-26 15:31:21 +0000</bug_when>
    <thetext>Hi,

I am trying add a new recipe DPDK and the build is generating the modules for the local host instead for yocto.

I was just wondering if there is any tweaking needed to make it build for yocto.

Thanks
Kishore.</thetext>
  </long_desc><long_desc isprivate="0" >
    <commentid>16488</commentid>
    <comment_count>1</comment_count>
    <who name="Nitin Kamble">nitin.a.kamble</who>
    <bug_when>2011-09-26 16:05:09 +0000</bug_when>
    <thetext>Kishore, 
  This seems like different than what you have explained to me earlier. 
Can you provide the steps to reproduce the issue ?

Thanks,
Nitin</thetext>
  </long_desc><long_desc isprivate="0" >
    <commentid>16489</commentid>
    <comment_count>2</comment_count>
      <attachid>256</attachid>
    <who name="kishore">kishore.k.bodke</who>
    <bug_when>2011-09-26 16:31:15 +0000</bug_when>
    <thetext>Created attachment 256
attached is the dpdk recipe

Hi,

Attached is the dpdk recipe.  Basically it is failing on while creating the softlinks for the header files.  The generated header file soft links are broken.

Source is available on request.

Below are the steps to build the dpdk.
1. make config O=x86_64-default-linuxapp-gcc T=x86_64-default-linuxapp-gcc
2. cd x86_64-default-linuxapp-gcc 
3. make

Below is the error message.

Loading cache...done.
Loaded 1034 entries from dependency cache.
NOTE: Resolving any missing task queue dependencies
NOTE: Preparing runqueue
NOTE: Executing SetScene Tasks
NOTE: Executing RunQueue Tasks

OE Build Configuration:
BB_VERSION        = &quot;1.13.3&quot;
TARGET_ARCH       = &quot;x86_64&quot;
TARGET_OS         = &quot;linux&quot;
MACHINE           = &quot;crystalforest&quot;
DISTRO            = &quot;poky&quot;
DISTRO_VERSION    = &quot;1.0+snapshot-20110926&quot;
TUNE_FEATURES     = &quot;m64&quot;
TARGET_FPU        = &quot;&quot;
meta              
meta-yocto        = &quot;master0:6c2b7beac3cd23ed44bd3e195c6360a0932876bf&quot;
meta-crystalforest 
dpdk              = &quot;master0:fb15cc4e1c4be75c81acaf6a1dd33675a9142975&quot;

NOTE: Running task 513 of 701 (ID: 4, /usr/local/src/crf/test/meta-intel/dpdk/recipes-devtools/intel-dpdk/intel-dpdk.bb, do_fetch)
NOTE: package intel-dpdk-1.0-r0: task do_fetch: Started
NOTE: package intel-dpdk-1.0-r0: task do_fetch: Succeeded
NOTE: Running task 691 of 701 (ID: 0, /usr/local/src/crf/test/meta-intel/dpdk/recipes-devtools/intel-dpdk/intel-dpdk.bb, do_unpack)
NOTE: package intel-dpdk-1.0-r0: task do_unpack: Started
NOTE: package intel-dpdk-1.0-r0: task do_unpack: Succeeded
NOTE: Running task 692 of 701 (ID: 1, /usr/local/src/crf/test/meta-intel/dpdk/recipes-devtools/intel-dpdk/intel-dpdk.bb, do_patch)
NOTE: package intel-dpdk-1.0-r0: task do_patch: Started
NOTE: package intel-dpdk-1.0-r0: task do_patch: Succeeded
NOTE: Running task 693 of 701 (ID: 6, /usr/local/src/crf/test/meta-intel/dpdk/recipes-devtools/intel-dpdk/intel-dpdk.bb, do_configure)
NOTE: Running task 694 of 701 (ID: 10, /usr/local/src/crf/test/meta-intel/dpdk/recipes-devtools/intel-dpdk/intel-dpdk.bb, do_populate_lic)
NOTE: package intel-dpdk-1.0-r0: task do_populate_lic: Started
NOTE: package intel-dpdk-1.0-r0: task do_configure: Started
NOTE: package intel-dpdk-1.0-r0: task do_populate_lic: Succeeded
NOTE: package intel-dpdk-1.0-r0: task do_configure: Succeeded
NOTE: Running task 695 of 701 (ID: 7, /usr/local/src/crf/test/meta-intel/dpdk/recipes-devtools/intel-dpdk/intel-dpdk.bb, do_compile)
NOTE: package intel-dpdk-1.0-r0: task do_compile: Started
ERROR: Function &apos;do_compile&apos; failed (see /usr/local/src/crf/test/builddpdk/tmp/work/x86_64-poky-linux/intel-dpdk-1.0-r0/temp/log.do_compile.1429 for further information)
ERROR: Logfile of failure stored in: /usr/local/src/crf/test/builddpdk/tmp/work/x86_64-poky-linux/intel-dpdk-1.0-r0/temp/log.do_compile.1429
Log data follows:
| make -f /usr/local/src/crf/test/builddpdk/tmp/work/x86_64-poky-linux/intel-dpdk-1.0-r0/intel-dpdk/mk/rte.sdkconfig.mk checkconfig
| make -f /usr/local/src/crf/test/builddpdk/tmp/work/x86_64-poky-linux/intel-dpdk-1.0-r0/intel-dpdk/mk/rte.sdkconfig.mk \
| 		headerconfig NODOTCONF=1
| make -f /usr/local/src/crf/test/builddpdk/tmp/work/x86_64-poky-linux/intel-dpdk-1.0-r0/intel-dpdk/mk/rte.sdkbuild.mk all
| == Build scripts
| make S=scripts -f /usr/local/src/crf/test/builddpdk/tmp/work/x86_64-poky-linux/intel-dpdk-1.0-r0/intel-dpdk/scripts/Makefile -C /usr/local/src/crf/test/builddpdk/tmp/work/x86_64-poky-linux/intel-dpdk-1.0-r0/intel-dpdk/x86_64-default-linuxapp-gcc/build/scripts all
| == Build scripts/testhost
| gcc -Wp,-MD,./.testhost.o.d.tmp -I/usr/local/src/crf/test/builddpdk/tmp/work/x86_64-poky-linux/intel-dpdk-1.0-r0/intel-dpdk/scripts/testhost   -o testhost.o -c /usr/local/src/crf/test/builddpdk/tmp/work/x86_64-poky-linux/intel-dpdk-1.0-r0/intel-dpdk/scripts/testhost/testhost.c
| gcc    -o testhost testhost.o
|   INSTALL-HOSTAPP testhost
| cp -f testhost /usr/local/src/crf/test/builddpdk/tmp/work/x86_64-poky-linux/intel-dpdk-1.0-r0/intel-dpdk/x86_64-default-linuxapp-gcc/hostapp
| == Build lib
| make S=lib -f /usr/local/src/crf/test/builddpdk/tmp/work/x86_64-poky-linux/intel-dpdk-1.0-r0/intel-dpdk/lib/Makefile -C /usr/local/src/crf/test/builddpdk/tmp/work/x86_64-poky-linux/intel-dpdk-1.0-r0/intel-dpdk/x86_64-default-linuxapp-gcc/build/lib all
| == Build lib/librte_eal
| == Build lib/librte_eal/common
|   SYMLINK-FILE include/rte_atomic.h
| ln -nsf `/usr/local/src/crf/test/builddpdk/tmp/work/x86_64-poky-linux/intel-dpdk-1.0-r0/intel-dpdk/scripts/relpath.sh /usr/local/src/crf/test/builddpdk/tmp/work/x86_64-poky-linux/intel-dpdk-1.0-r0/intel-dpdk/lib/librte_eal/common/include/rte_atomic.h /usr/local/src/crf/test/builddpdk/tmp/work/x86_64-poky-linux/intel-dpdk-1.0-r0/intel-dpdk/x86_64-default-linuxapp-gcc/include` /usr/local/src/crf/test/builddpdk/tmp/work/x86_64-poky-linux/intel-dpdk-1.0-r0/intel-dpdk/x86_64-default-linuxapp-gcc/include
|   SYMLINK-FILE include/rte_cycles.h
| ln -nsf `/usr/local/src/crf/test/builddpdk/tmp/work/x86_64-poky-linux/intel-dpdk-1.0-r0/intel-dpdk/scripts/relpath.sh /usr/local/src/crf/test/builddpdk/tmp/work/x86_64-poky-linux/intel-dpdk-1.0-r0/intel-dpdk/lib/librte_eal/common/include/rte_cycles.h /usr/local/src/crf/test/builddpdk/tmp/work/x86_64-poky-linux/intel-dpdk-1.0-r0/intel-dpdk/x86_64-default-linuxapp-gcc/include` /usr/local/src/crf/test/builddpdk/tmp/work/x86_64-poky-linux/intel-dpdk-1.0-r0/intel-dpdk/x86_64-default-linuxapp-gcc/include
|   SYMLINK-FILE include/rte_debug.h
| ln -nsf `/usr/local/src/crf/test/builddpdk/tmp/work/x86_64-poky-linux/intel-dpdk-1.0-r0/intel-dpdk/scripts/relpath.sh /usr/local/src/crf/test/builddpdk/tmp/work/x86_64-poky-linux/intel-dpdk-1.0-r0/intel-dpdk/lib/librte_eal/common/include/rte_debug.h /usr/local/src/crf/test/builddpdk/tmp/work/x86_64-poky-linux/intel-dpdk-1.0-r0/intel-dpdk/x86_64-default-linuxapp-gcc/include` /usr/local/src/crf/test/builddpdk/tmp/work/x86_64-poky-linux/intel-dpdk-1.0-r0/intel-dpdk/x86_64-default-linuxapp-gcc/include
|   SYMLINK-FILE include/rte_eal.h
| ln -nsf `/usr/local/src/crf/test/builddpdk/tmp/work/x86_64-poky-linux/intel-dpdk-1.0-r0/intel-dpdk/scripts/relpath.sh /usr/local/src/crf/test/builddpdk/tmp/work/x86_64-poky-linux/intel-dpdk-1.0-r0/intel-dpdk/lib/librte_eal/common/include/rte_eal.h /usr/local/src/crf/test/builddpdk/tmp/work/x86_64-poky-linux/intel-dpdk-1.0-r0/intel-dpdk/x86_64-default-linuxapp-gcc/include` /usr/local/src/crf/test/builddpdk/tmp/work/x86_64-poky-linux/intel-dpdk-1.0-r0/intel-dpdk/x86_64-default-linuxapp-gcc/include
|   SYMLINK-FILE include/rte_launch.h
| ln -nsf `/usr/local/src/crf/test/builddpdk/tmp/work/x86_64-poky-linux/intel-dpdk-1.0-r0/intel-dpdk/scripts/relpath.sh /usr/local/src/crf/test/builddpdk/tmp/work/x86_64-poky-linux/intel-dpdk-1.0-r0/intel-dpdk/lib/librte_eal/common/include/rte_launch.h /usr/local/src/crf/test/builddpdk/tmp/work/x86_64-poky-linux/intel-dpdk-1.0-r0/intel-dpdk/x86_64-default-linuxapp-gcc/include` /usr/local/src/crf/test/builddpdk/tmp/work/x86_64-poky-linux/intel-dpdk-1.0-r0/intel-dpdk/x86_64-default-linuxapp-gcc/include
|   SYMLINK-FILE include/rte_lcore.h
| ln -nsf `/usr/local/src/crf/test/builddpdk/tmp/work/x86_64-poky-linux/intel-dpdk-1.0-r0/intel-dpdk/scripts/relpath.sh /usr/local/src/crf/test/builddpdk/tmp/work/x86_64-poky-linux/intel-dpdk-1.0-r0/intel-dpdk/lib/librte_eal/common/include/rte_lcore.h /usr/local/src/crf/test/builddpdk/tmp/work/x86_64-poky-linux/intel-dpdk-1.0-r0/intel-dpdk/x86_64-default-linuxapp-gcc/include` /usr/local/src/crf/test/builddpdk/tmp/work/x86_64-poky-linux/intel-dpdk-1.0-r0/intel-dpdk/x86_64-default-linuxapp-gcc/include
|   SYMLINK-FILE include/rte_log.h
| ln -nsf `/usr/local/src/crf/test/builddpdk/tmp/work/x86_64-poky-linux/intel-dpdk-1.0-r0/intel-dpdk/scripts/relpath.sh /usr/local/src/crf/test/builddpdk/tmp/work/x86_64-poky-linux/intel-dpdk-1.0-r0/intel-dpdk/lib/librte_eal/common/include/rte_log.h /usr/local/src/crf/test/builddpdk/tmp/work/x86_64-poky-linux/intel-dpdk-1.0-r0/intel-dpdk/x86_64-default-linuxapp-gcc/include` /usr/local/src/crf/test/builddpdk/tmp/work/x86_64-poky-linux/intel-dpdk-1.0-r0/intel-dpdk/x86_64-default-linuxapp-gcc/include
|   SYMLINK-FILE include/rte_memory.h
| ln -nsf `/usr/local/src/crf/test/builddpdk/tmp/work/x86_64-poky-linux/intel-dpdk-1.0-r0/intel-dpdk/scripts/relpath.sh /usr/local/src/crf/test/builddpdk/tmp/work/x86_64-poky-linux/intel-dpdk-1.0-r0/intel-dpdk/lib/librte_eal/common/include/rte_memory.h /usr/local/src/crf/test/builddpdk/tmp/work/x86_64-poky-linux/intel-dpdk-1.0-r0/intel-dpdk/x86_64-default-linuxapp-gcc/include` /usr/local/src/crf/test/builddpdk/tmp/work/x86_64-poky-linux/intel-dpdk-1.0-r0/intel-dpdk/x86_64-default-linuxapp-gcc/include
|   SYMLINK-FILE include/rte_pci.h
| ln -nsf `/usr/local/src/crf/test/builddpdk/tmp/work/x86_64-poky-linux/intel-dpdk-1.0-r0/intel-dpdk/scripts/relpath.sh /usr/local/src/crf/test/builddpdk/tmp/work/x86_64-poky-linux/intel-dpdk-1.0-r0/intel-dpdk/lib/librte_eal/common/include/rte_pci.h /usr/local/src/crf/test/builddpdk/tmp/work/x86_64-poky-linux/intel-dpdk-1.0-r0/intel-dpdk/x86_64-default-linuxapp-gcc/include` /usr/local/src/crf/test/builddpdk/tmp/work/x86_64-poky-linux/intel-dpdk-1.0-r0/intel-dpdk/x86_64-default-linuxapp-gcc/include
|   SYMLINK-FILE include/rte_per_lcore.h
| ln -nsf `/usr/local/src/crf/test/builddpdk/tmp/work/x86_64-poky-linux/intel-dpdk-1.0-r0/intel-dpdk/scripts/relpath.sh /usr/local/src/crf/test/builddpdk/tmp/work/x86_64-poky-linux/intel-dpdk-1.0-r0/intel-dpdk/lib/librte_eal/common/include/rte_per_lcore.h /usr/local/src/crf/test/builddpdk/tmp/work/x86_64-poky-linux/intel-dpdk-1.0-r0/intel-dpdk/x86_64-default-linuxapp-gcc/include` /usr/local/src/crf/test/builddpdk/tmp/work/x86_64-poky-linux/intel-dpdk-1.0-r0/intel-dpdk/x86_64-default-linuxapp-gcc/include
|   SYMLINK-FILE include/rte_prefetch.h
| ln -nsf `/usr/local/src/crf/test/builddpdk/tmp/work/x86_64-poky-linux/intel-dpdk-1.0-r0/intel-dpdk/scripts/relpath.sh /usr/local/src/crf/test/builddpdk/tmp/work/x86_64-poky-linux/intel-dpdk-1.0-r0/intel-dpdk/lib/librte_eal/common/include/rte_prefetch.h /usr/local/src/crf/test/builddpdk/tmp/work/x86_64-poky-linux/intel-dpdk-1.0-r0/intel-dpdk/x86_64-default-linuxapp-gcc/include` /usr/local/src/crf/test/builddpdk/tmp/work/x86_64-poky-linux/intel-dpdk-1.0-r0/intel-dpdk/x86_64-default-linuxapp-gcc/include
|   SYMLINK-FILE include/rte_rwlock.h
| ln -nsf `/usr/local/src/crf/test/builddpdk/tmp/work/x86_64-poky-linux/intel-dpdk-1.0-r0/intel-dpdk/scripts/relpath.sh /usr/local/src/crf/test/builddpdk/tmp/work/x86_64-poky-linux/intel-dpdk-1.0-r0/intel-dpdk/lib/librte_eal/common/include/rte_rwlock.h /usr/local/src/crf/test/builddpdk/tmp/work/x86_64-poky-linux/intel-dpdk-1.0-r0/intel-dpdk/x86_64-default-linuxapp-gcc/include` /usr/local/src/crf/test/builddpdk/tmp/work/x86_64-poky-linux/intel-dpdk-1.0-r0/intel-dpdk/x86_64-default-linuxapp-gcc/include
|   SYMLINK-FILE include/rte_spinlock.h
| ln -nsf `/usr/local/src/crf/test/builddpdk/tmp/work/x86_64-poky-linux/intel-dpdk-1.0-r0/intel-dpdk/scripts/relpath.sh /usr/local/src/crf/test/builddpdk/tmp/work/x86_64-poky-linux/intel-dpdk-1.0-r0/intel-dpdk/lib/librte_eal/common/include/rte_spinlock.h /usr/local/src/crf/test/builddpdk/tmp/work/x86_64-poky-linux/intel-dpdk-1.0-r0/intel-dpdk/x86_64-default-linuxapp-gcc/include` /usr/local/src/crf/test/builddpdk/tmp/work/x86_64-poky-linux/intel-dpdk-1.0-r0/intel-dpdk/x86_64-default-linuxapp-gcc/include
|   SYMLINK-FILE include/rte_memzone.h
| ln -nsf `/usr/local/src/crf/test/builddpdk/tmp/work/x86_64-poky-linux/intel-dpdk-1.0-r0/intel-dpdk/scripts/relpath.sh /usr/local/src/crf/test/builddpdk/tmp/work/x86_64-poky-linux/intel-dpdk-1.0-r0/intel-dpdk/lib/librte_eal/common/include/rte_memzone.h /usr/local/src/crf/test/builddpdk/tmp/work/x86_64-poky-linux/intel-dpdk-1.0-r0/intel-dpdk/x86_64-default-linuxapp-gcc/include` /usr/local/src/crf/test/builddpdk/tmp/work/x86_64-poky-linux/intel-dpdk-1.0-r0/intel-dpdk/x86_64-default-linuxapp-gcc/include
|   SYMLINK-FILE include/rte_branch_prediction.h
| ln -nsf `/usr/local/src/crf/test/builddpdk/tmp/work/x86_64-poky-linux/intel-dpdk-1.0-r0/intel-dpdk/scripts/relpath.sh /usr/local/src/crf/test/builddpdk/tmp/work/x86_64-poky-linux/intel-dpdk-1.0-r0/intel-dpdk/lib/librte_eal/common/include/rte_branch_prediction.h /usr/local/src/crf/test/builddpdk/tmp/work/x86_64-poky-linux/intel-dpdk-1.0-r0/intel-dpdk/x86_64-default-linuxapp-gcc/include` /usr/local/src/crf/test/builddpdk/tmp/work/x86_64-poky-linux/intel-dpdk-1.0-r0/intel-dpdk/x86_64-default-linuxapp-gcc/include
|   SYMLINK-FILE include/rte_byteorder.h
| ln -nsf `/usr/local/src/crf/test/builddpdk/tmp/work/x86_64-poky-linux/intel-dpdk-1.0-r0/intel-dpdk/scripts/relpath.sh /usr/local/src/crf/test/builddpdk/tmp/work/x86_64-poky-linux/intel-dpdk-1.0-r0/intel-dpdk/lib/librte_eal/common/include/rte_byteorder.h /usr/local/src/crf/test/builddpdk/tmp/work/x86_64-poky-linux/intel-dpdk-1.0-r0/intel-dpdk/x86_64-default-linuxapp-gcc/include` /usr/local/src/crf/test/builddpdk/tmp/work/x86_64-poky-linux/intel-dpdk-1.0-r0/intel-dpdk/x86_64-default-linuxapp-gcc/include
|   SYMLINK-FILE include/rte_random.h
| ln -nsf `/usr/local/src/crf/test/builddpdk/tmp/work/x86_64-poky-linux/intel-dpdk-1.0-r0/intel-dpdk/scripts/relpath.sh /usr/local/src/crf/test/builddpdk/tmp/work/x86_64-poky-linux/intel-dpdk-1.0-r0/intel-dpdk/lib/librte_eal/common/include/rte_random.h /usr/local/src/crf/test/builddpdk/tmp/work/x86_64-poky-linux/intel-dpdk-1.0-r0/intel-dpdk/x86_64-default-linuxapp-gcc/include` /usr/local/src/crf/test/builddpdk/tmp/work/x86_64-poky-linux/intel-dpdk-1.0-r0/intel-dpdk/x86_64-default-linuxapp-gcc/include
|   SYMLINK-FILE include/rte_memcpy.h
| ln -nsf `/usr/local/src/crf/test/builddpdk/tmp/work/x86_64-poky-linux/intel-dpdk-1.0-r0/intel-dpdk/scripts/relpath.sh /usr/local/src/crf/test/builddpdk/tmp/work/x86_64-poky-linux/intel-dpdk-1.0-r0/intel-dpdk/lib/librte_eal/common/include/rte_memcpy.h /usr/local/src/crf/test/builddpdk/tmp/work/x86_64-poky-linux/intel-dpdk-1.0-r0/intel-dpdk/x86_64-default-linuxapp-gcc/include` /usr/local/src/crf/test/builddpdk/tmp/work/x86_64-poky-linux/intel-dpdk-1.0-r0/intel-dpdk/x86_64-default-linuxapp-gcc/include
|   SYMLINK-FILE include/arch/rte_atomic.h
| ln -nsf `/usr/local/src/crf/test/builddpdk/tmp/work/x86_64-poky-linux/intel-dpdk-1.0-r0/intel-dpdk/scripts/relpath.sh /usr/local/src/crf/test/builddpdk/tmp/work/x86_64-poky-linux/intel-dpdk-1.0-r0/intel-dpdk/lib/librte_eal/common/include/x86_64/arch/rte_atomic.h /usr/local/src/crf/test/builddpdk/tmp/work/x86_64-poky-linux/intel-dpdk-1.0-r0/intel-dpdk/x86_64-default-linuxapp-gcc/include/arch` /usr/local/src/crf/test/builddpdk/tmp/work/x86_64-poky-linux/intel-dpdk-1.0-r0/intel-dpdk/x86_64-default-linuxapp-gcc/include/arch
|   SYMLINK-FILE include/arch/rte_spinlock.h
| ln -nsf `/usr/local/src/crf/test/builddpdk/tmp/work/x86_64-poky-linux/intel-dpdk-1.0-r0/intel-dpdk/scripts/relpath.sh /usr/local/src/crf/test/builddpdk/tmp/work/x86_64-poky-linux/intel-dpdk-1.0-r0/intel-dpdk/lib/librte_eal/common/include/x86_64/arch/rte_spinlock.h /usr/local/src/crf/test/builddpdk/tmp/work/x86_64-poky-linux/intel-dpdk-1.0-r0/intel-dpdk/x86_64-default-linuxapp-gcc/include/arch` /usr/local/src/crf/test/builddpdk/tmp/work/x86_64-poky-linux/intel-dpdk-1.0-r0/intel-dpdk/x86_64-default-linuxapp-gcc/include/arch
|   SYMLINK-FILE include/arch/rte_prefetch.h
| ln -nsf `/usr/local/src/crf/test/builddpdk/tmp/work/x86_64-poky-linux/intel-dpdk-1.0-r0/intel-dpdk/scripts/relpath.sh /usr/local/src/crf/test/builddpdk/tmp/work/x86_64-poky-linux/intel-dpdk-1.0-r0/intel-dpdk/lib/librte_eal/common/include/x86_64/arch/rte_prefetch.h /usr/local/src/crf/test/builddpdk/tmp/work/x86_64-poky-linux/intel-dpdk-1.0-r0/intel-dpdk/x86_64-default-linuxapp-gcc/include/arch` /usr/local/src/crf/test/builddpdk/tmp/work/x86_64-poky-linux/intel-dpdk-1.0-r0/intel-dpdk/x86_64-default-linuxapp-gcc/include/arch
|   SYMLINK-FILE include/arch/rte_byteorder.h
| ln -nsf `/usr/local/src/crf/test/builddpdk/tmp/work/x86_64-poky-linux/intel-dpdk-1.0-r0/intel-dpdk/scripts/relpath.sh /usr/local/src/crf/test/builddpdk/tmp/work/x86_64-poky-linux/intel-dpdk-1.0-r0/intel-dpdk/lib/librte_eal/common/include/x86_64/arch/rte_byteorder.h /usr/local/src/crf/test/builddpdk/tmp/work/x86_64-poky-linux/intel-dpdk-1.0-r0/intel-dpdk/x86_64-default-linuxapp-gcc/include/arch` /usr/local/src/crf/test/builddpdk/tmp/work/x86_64-poky-linux/intel-dpdk-1.0-r0/intel-dpdk/x86_64-default-linuxapp-gcc/include/arch
| == Build lib/librte_eal/linuxapp
| == Build lib/librte_eal/linuxapp/igb_uio
| make -C /usr/src/linux-headers-2.6.34-020634-generic \
| 	KBUILD_SRC=/usr/src/linux-headers-2.6.34-020634-generic \
| 	KBUILD_EXTMOD=&quot;/usr/local/src/crf/test/builddpdk/tmp/work/x86_64-poky-linux/intel-dpdk-1.0-r0/intel-dpdk/x86_64-default-linuxapp-gcc/build/lib/librte_eal/linuxapp/igb_uio&quot; -f /usr/src/linux-headers-2.6.34-020634-generic/Makefile \
| 
| test -e include/generated/autoconf.h -a -e include/config/auto.conf || (		\
| 	echo;								\
| 	echo &quot;  ERROR: Kernel configuration is invalid.&quot;;		\
| 	echo &quot;         include/generated/autoconf.h or include/config/auto.conf are missing.&quot;;\
| 	echo &quot;         Run &apos;make oldconfig &amp;&amp; make prepare&apos; on kernel src to fix it.&quot;;	\
| 	echo;								\
| 	/bin/false)
| mkdir -p /usr/local/src/crf/test/builddpdk/tmp/work/x86_64-poky-linux/intel-dpdk-1.0-r0/intel-dpdk/x86_64-default-linuxapp-gcc/build/lib/librte_eal/linuxapp/igb_uio/.tmp_versions ; rm -f /usr/local/src/crf/test/builddpdk/tmp/work/x86_64-poky-linux/intel-dpdk-1.0-r0/intel-dpdk/x86_64-default-linuxapp-gcc/build/lib/librte_eal/linuxapp/igb_uio/.tmp_versions/*
| make -f /usr/src/linux-headers-2.6.34-020634-generic/scripts/Makefile.build obj=/usr/local/src/crf/test/builddpdk/tmp/work/x86_64-poky-linux/intel-dpdk-1.0-r0/intel-dpdk/x86_64-default-linuxapp-gcc/build/lib/librte_eal/linuxapp/igb_uio
|    rm -f /usr/local/src/crf/test/builddpdk/tmp/work/x86_64-poky-linux/intel-dpdk-1.0-r0/intel-dpdk/x86_64-default-linuxapp-gcc/build/lib/librte_eal/linuxapp/igb_uio/built-in.o; ar rcs /usr/local/src/crf/test/builddpdk/tmp/work/x86_64-poky-linux/intel-dpdk-1.0-r0/intel-dpdk/x86_64-default-linuxapp-gcc/build/lib/librte_eal/linuxapp/igb_uio/built-in.o
|   gcc -Wp,-MD,/usr/local/src/crf/test/builddpdk/tmp/work/x86_64-poky-linux/intel-dpdk-1.0-r0/intel-dpdk/x86_64-default-linuxapp-gcc/build/lib/librte_eal/linuxapp/igb_uio/.igb_uio.o.d  -nostdinc -isystem /usr/lib/gcc/x86_64-linux-gnu/4.4.3/include -I/usr/src/linux-headers-2.6.34-020634-generic/arch/x86/include -Iinclude  -I/usr/src/linux-headers-2.6.34-020634-generic/include -include include/generated/autoconf.h   -I/usr/local/src/crf/test/builddpdk/tmp/work/x86_64-poky-linux/intel-dpdk-1.0-r0/intel-dpdk/x86_64-default-linuxapp-gcc/build/lib/librte_eal/linuxapp/igb_uio -D__KERNEL__ -Wall -Wundef -Wstrict-prototypes -Wno-trigraphs -fno-strict-aliasing -fno-common -Werror-implicit-function-declaration -Wno-format-security -fno-delete-null-pointer-checks -O2 -m64 -mtune=generic -mno-red-zone -mcmodel=kernel -funit-at-a-time -maccumulate-outgoing-args -fstack-protector -DCONFIG_AS_CFI=1 -DCONFIG_AS_CFI_SIGNAL_FRAME=1 -pipe -Wno-sign-compare -fno-asynchronous-unwind-tables -mno-sse -mno-mmx -mno-sse2 -mno-3dnow -Wframe-larger-than=1024 -fno-omit-frame-pointer -fno-optimize-sibling-calls -pg -Wdeclaration-after-statement -Wno-pointer-sign -fno-strict-overflow -fno-dwarf2-cfi-asm -fconserve-stack   -I/usr/local/src/crf/test/builddpdk/tmp/work/x86_64-poky-linux/intel-dpdk-1.0-r0/intel-dpdk/lib/librte_eal/linuxapp/igb_uio -Winline -Wall -Werror -include /usr/local/src/crf/test/builddpdk/tmp/work/x86_64-poky-linux/intel-dpdk-1.0-r0/intel-dpdk/x86_64-default-linuxapp-gcc/include/rte_config.h  -DMODULE -D&quot;KBUILD_STR(s)=#s&quot; -D&quot;KBUILD_BASENAME=KBUILD_STR(igb_uio)&quot;  -D&quot;KBUILD_MODNAME=KBUILD_STR(igb_uio)&quot;  -c -o /usr/local/src/crf/test/builddpdk/tmp/work/x86_64-poky-linux/intel-dpdk-1.0-r0/intel-dpdk/x86_64-default-linuxapp-gcc/build/lib/librte_eal/linuxapp/igb_uio/.tmp_igb_uio.o /usr/local/src/crf/test/builddpdk/tmp/work/x86_64-poky-linux/intel-dpdk-1.0-r0/intel-dpdk/x86_64-default-linuxapp-gcc/build/lib/librte_eal/linuxapp/igb_uio/igb_uio.c
|   set -e ; perl /usr/src/linux-headers-2.6.34-020634-generic/scripts/recordmcount.pl &quot;x86_64&quot; &quot;little&quot; &quot;64&quot; &quot;objdump&quot; &quot;objcopy&quot; &quot;gcc&quot; &quot;ld&quot; &quot;nm&quot; &quot;&quot; &quot;&quot; &quot;1&quot; &quot;/usr/local/src/crf/test/builddpdk/tmp/work/x86_64-poky-linux/intel-dpdk-1.0-r0/intel-dpdk/x86_64-default-linuxapp-gcc/build/lib/librte_eal/linuxapp/igb_uio/igb_uio.o&quot;;
| (cat /dev/null;   echo kernel//usr/local/src/crf/test/builddpdk/tmp/work/x86_64-poky-linux/intel-dpdk-1.0-r0/intel-dpdk/x86_64-default-linuxapp-gcc/build/lib/librte_eal/linuxapp/igb_uio/igb_uio.ko;) &gt; /usr/local/src/crf/test/builddpdk/tmp/work/x86_64-poky-linux/intel-dpdk-1.0-r0/intel-dpdk/x86_64-default-linuxapp-gcc/build/lib/librte_eal/linuxapp/igb_uio/modules.order
| make -f /usr/src/linux-headers-2.6.34-020634-generic/scripts/Makefile.modpost
|   scripts/mod/modpost -m -a -i /usr/src/linux-headers-2.6.34-020634-generic/Module.symvers -I /usr/local/src/crf/test/builddpdk/tmp/work/x86_64-poky-linux/intel-dpdk-1.0-r0/intel-dpdk/x86_64-default-linuxapp-gcc/build/lib/librte_eal/linuxapp/igb_uio/Module.symvers  -o /usr/local/src/crf/test/builddpdk/tmp/work/x86_64-poky-linux/intel-dpdk-1.0-r0/intel-dpdk/x86_64-default-linuxapp-gcc/build/lib/librte_eal/linuxapp/igb_uio/Module.symvers -S -w  -s
|   gcc -Wp,-MD,/usr/local/src/crf/test/builddpdk/tmp/work/x86_64-poky-linux/intel-dpdk-1.0-r0/intel-dpdk/x86_64-default-linuxapp-gcc/build/lib/librte_eal/linuxapp/igb_uio/.igb_uio.mod.o.d  -nostdinc -isystem /usr/lib/gcc/x86_64-linux-gnu/4.4.3/include -I/usr/src/linux-headers-2.6.34-020634-generic/arch/x86/include -Iinclude  -I/usr/src/linux-headers-2.6.34-020634-generic/include -include include/generated/autoconf.h   -I/usr/local/src/crf/test/builddpdk/tmp/work/x86_64-poky-linux/intel-dpdk-1.0-r0/intel-dpdk/x86_64-default-linuxapp-gcc/build/lib/librte_eal/linuxapp/igb_uio -D__KERNEL__ -Wall -Wundef -Wstrict-prototypes -Wno-trigraphs -fno-strict-aliasing -fno-common -Werror-implicit-function-declaration -Wno-format-security -fno-delete-null-pointer-checks -O2 -m64 -mtune=generic -mno-red-zone -mcmodel=kernel -funit-at-a-time -maccumulate-outgoing-args -fstack-protector -DCONFIG_AS_CFI=1 -DCONFIG_AS_CFI_SIGNAL_FRAME=1 -pipe -Wno-sign-compare -fno-asynchronous-unwind-tables -mno-sse -mno-mmx -mno-sse2 -mno-3dnow -Wframe-larger-than=1024 -fno-omit-frame-pointer -fno-optimize-sibling-calls -pg -Wdeclaration-after-statement -Wno-pointer-sign -fno-strict-overflow -fno-dwarf2-cfi-asm -fconserve-stack   -I/usr/local/src/crf/test/builddpdk/tmp/work/x86_64-poky-linux/intel-dpdk-1.0-r0/intel-dpdk/lib/librte_eal/linuxapp/igb_uio -Winline -Wall -Werror -include /usr/local/src/crf/test/builddpdk/tmp/work/x86_64-poky-linux/intel-dpdk-1.0-r0/intel-dpdk/x86_64-default-linuxapp-gcc/include/rte_config.h  -D&quot;KBUILD_STR(s)=#s&quot; -D&quot;KBUILD_BASENAME=KBUILD_STR(igb_uio.mod)&quot;  -D&quot;KBUILD_MODNAME=KBUILD_STR(igb_uio)&quot;  -DMODULE -c -o /usr/local/src/crf/test/builddpdk/tmp/work/x86_64-poky-linux/intel-dpdk-1.0-r0/intel-dpdk/x86_64-default-linuxapp-gcc/build/lib/librte_eal/linuxapp/igb_uio/igb_uio.mod.o /usr/local/src/crf/test/builddpdk/tmp/work/x86_64-poky-linux/intel-dpdk-1.0-r0/intel-dpdk/x86_64-default-linuxapp-gcc/build/lib/librte_eal/linuxapp/igb_uio/igb_uio.mod.c
|   ld -r -m elf_x86_64 -T /usr/src/linux-headers-2.6.34-020634-generic/scripts/module-common.lds --build-id -o /usr/local/src/crf/test/builddpdk/tmp/work/x86_64-poky-linux/intel-dpdk-1.0-r0/intel-dpdk/x86_64-default-linuxapp-gcc/build/lib/librte_eal/linuxapp/igb_uio/igb_uio.ko /usr/local/src/crf/test/builddpdk/tmp/work/x86_64-poky-linux/intel-dpdk-1.0-r0/intel-dpdk/x86_64-default-linuxapp-gcc/build/lib/librte_eal/linuxapp/igb_uio/igb_uio.o /usr/local/src/crf/test/builddpdk/tmp/work/x86_64-poky-linux/intel-dpdk-1.0-r0/intel-dpdk/x86_64-default-linuxapp-gcc/build/lib/librte_eal/linuxapp/igb_uio/igb_uio.mod.o
| INSTALL-MODULE igb_uio.ko
| == Build lib/librte_eal/linuxapp/eal
| gcc -Wp,-MD,./.eal.o.d.tmp -m64 -pthread  -O2 -pipe -g -feliminate-unused-debug-types -I/usr/local/src/crf/test/builddpdk/tmp/work/x86_64-poky-linux/intel-dpdk-1.0-r0/intel-dpdk/x86_64-default-linuxapp-gcc/include -include /usr/local/src/crf/test/builddpdk/tmp/work/x86_64-poky-linux/intel-dpdk-1.0-r0/intel-dpdk/x86_64-default-linuxapp-gcc/include/rte_config.h -I/usr/local/src/crf/test/builddpdk/tmp/work/x86_64-poky-linux/intel-dpdk-1.0-r0/intel-dpdk/lib/librte_eal/linuxapp/eal/include -I/usr/local/src/crf/test/builddpdk/tmp/work/x86_64-poky-linux/intel-dpdk-1.0-r0/intel-dpdk/lib/librte_eal/common/include -I/usr/local/src/crf/test/builddpdk/tmp/work/x86_64-poky-linux/intel-dpdk-1.0-r0/intel-dpdk/lib/librte_ring -I/usr/local/src/crf/test/builddpdk/tmp/work/x86_64-poky-linux/intel-dpdk-1.0-r0/intel-dpdk/lib/librte_mempool -W -Wall -Werror -O3 -D_GNU_SOURCE  -o eal.o -c /usr/local/src/crf/test/builddpdk/tmp/work/x86_64-poky-linux/intel-dpdk-1.0-r0/intel-dpdk/lib/librte_eal/linuxapp/eal/eal.c
| gcc -Wp,-MD,./.eal_memory.o.d.tmp -m64 -pthread  -O2 -pipe -g -feliminate-unused-debug-types -I/usr/local/src/crf/test/builddpdk/tmp/work/x86_64-poky-linux/intel-dpdk-1.0-r0/intel-dpdk/x86_64-default-linuxapp-gcc/include -include /usr/local/src/crf/test/builddpdk/tmp/work/x86_64-poky-linux/intel-dpdk-1.0-r0/intel-dpdk/x86_64-default-linuxapp-gcc/include/rte_config.h -I/usr/local/src/crf/test/builddpdk/tmp/work/x86_64-poky-linux/intel-dpdk-1.0-r0/intel-dpdk/lib/librte_eal/linuxapp/eal/include -I/usr/local/src/crf/test/builddpdk/tmp/work/x86_64-poky-linux/intel-dpdk-1.0-r0/intel-dpdk/lib/librte_eal/common/include -I/usr/local/src/crf/test/builddpdk/tmp/work/x86_64-poky-linux/intel-dpdk-1.0-r0/intel-dpdk/lib/librte_ring -I/usr/local/src/crf/test/builddpdk/tmp/work/x86_64-poky-linux/intel-dpdk-1.0-r0/intel-dpdk/lib/librte_mempool -W -Wall -Werror -O3   -o eal_memory.o -c /usr/local/src/crf/test/builddpdk/tmp/work/x86_64-poky-linux/intel-dpdk-1.0-r0/intel-dpdk/lib/librte_eal/linuxapp/eal/eal_memory.c
| gcc -Wp,-MD,./.eal_thread.o.d.tmp -m64 -pthread  -O2 -pipe -g -feliminate-unused-debug-types -I/usr/local/src/crf/test/builddpdk/tmp/work/x86_64-poky-linux/intel-dpdk-1.0-r0/intel-dpdk/x86_64-default-linuxapp-gcc/include -include /usr/local/src/crf/test/builddpdk/tmp/work/x86_64-poky-linux/intel-dpdk-1.0-r0/intel-dpdk/x86_64-default-linuxapp-gcc/include/rte_config.h -I/usr/local/src/crf/test/builddpdk/tmp/work/x86_64-poky-linux/intel-dpdk-1.0-r0/intel-dpdk/lib/librte_eal/linuxapp/eal/include -I/usr/local/src/crf/test/builddpdk/tmp/work/x86_64-poky-linux/intel-dpdk-1.0-r0/intel-dpdk/lib/librte_eal/common/include -I/usr/local/src/crf/test/builddpdk/tmp/work/x86_64-poky-linux/intel-dpdk-1.0-r0/intel-dpdk/lib/librte_ring -I/usr/local/src/crf/test/builddpdk/tmp/work/x86_64-poky-linux/intel-dpdk-1.0-r0/intel-dpdk/lib/librte_mempool -W -Wall -Werror -O3 -D_GNU_SOURCE -Wno-return-type  -o eal_thread.o -c /usr/local/src/crf/test/builddpdk/tmp/work/x86_64-poky-linux/intel-dpdk-1.0-r0/intel-dpdk/lib/librte_eal/linuxapp/eal/eal_thread.c
| In file included from /usr/local/src/crf/test/builddpdk/tmp/work/x86_64-poky-linux/intel-dpdk-1.0-r0/intel-dpdk/lib/librte_eal/linuxapp/eal/eal_thread.c:44:
| /usr/local/src/crf/test/builddpdk/tmp/work/x86_64-poky-linux/intel-dpdk-1.0-r0/intel-dpdk/lib/librte_eal/common/include/rte_atomic.h:146:29: error: arch/rte_atomic.h: No such file or directory
| cc1: warnings being treated as errors
| /usr/local/src/crf/test/builddpdk/tmp/work/x86_64-poky-linuERROR: Function &apos;do_compile&apos; failed (see /usr/local/src/crf/test/builddpdk/tmp/work/x86_64-poky-linux/intel-dpdk-1.0-r0/temp/log.do_compile.1429 for further information)
| x/intel-dpdk-1.0-r0/intel-dpdk/lib/librte_eal/linuxapp/eal/eal_thread.c: In function &apos;eal_thread_loop&apos;:
| /usr/local/src/crf/test/builddpdk/tmp/work/x86_64-poky-linux/intel-dpdk-1.0-r0/intel-dpdk/lib/librte_eal/linuxapp/eal/eal_thread.c:226: error: implicit declaration of function &apos;rte_wmb&apos;
| make[6]: *** [eal_thread.o] Error 1
| make[5]: *** [eal] Error 2
| make[4]: *** [linuxapp] Error 2
| make[3]: *** [librte_eal] Error 2
| make[2]: *** [lib] Error 2
| make[1]: *** [all] Error 2
| make: *** [all] Error 2
NOTE: package intel-dpdk-1.0-r0: task do_compile: Failed
ERROR: Task 7 (/usr/local/src/crf/test/meta-intel/dpdk/recipes-devtools/intel-dpdk/intel-dpdk.bb, do_compile) failed with exit code &apos;1&apos;
ERROR: &apos;/usr/local/src/crf/test/meta-intel/dpdk/recipes-devtools/intel-dpdk/intel-dpdk.bb&apos; failed</thetext>
  </long_desc><long_desc isprivate="0" >
    <commentid>16490</commentid>
    <comment_count>3</comment_count>
      <attachid>257</attachid>
    <who name="Nitin Kamble">nitin.a.kamble</who>
    <bug_when>2011-09-26 16:42:47 +0000</bug_when>
    <thetext>Created attachment 257
patch to the recipe to fix the issue</thetext>
  </long_desc><long_desc isprivate="0" >
    <commentid>16491</commentid>
    <comment_count>4</comment_count>
    <who name="Nitin Kamble">nitin.a.kamble</who>
    <bug_when>2011-09-26 16:44:59 +0000</bug_when>
    <thetext>Kishore,
  I found the issue. The issue is in the realpath.sh script. It is assuming that a var named prefix is empty. But the &quot;prefix&quot; var has special meaning in the gnu build environment. It tells path to use for installing files on the target.
  In yocto it is set to a default value of &quot;/usr&quot; which is well accepted by the dpdk script. I just initialized it to an emptry string in the script, and that solved the issue.
  I have updated your recipe to include this fix, you can verify it on your system.

Nitin</thetext>
  </long_desc><long_desc isprivate="0" >
    <commentid>16492</commentid>
    <comment_count>5</comment_count>
    <who name="kishore">kishore.k.bodke</who>
    <bug_when>2011-09-26 16:58:18 +0000</bug_when>
    <thetext>The issue of broken soft links got fixed with this patch.  But the build is still generating the kernel modules for the local host and not for the yocto target.

Thanks
Kishore.</thetext>
  </long_desc><long_desc isprivate="0" >
    <commentid>16493</commentid>
    <comment_count>6</comment_count>
    <who name="kishore">kishore.k.bodke</who>
    <bug_when>2011-09-26 17:00:26 +0000</bug_when>
    <thetext>(In reply to comment #5)
 The issue of broken soft links got fixed with this patch.  But the build is
 still generating the kernel modules for the local host and not for the yocto
 target.
 Thanks
 Kishore.</thetext>
  </long_desc><long_desc isprivate="0" >
    <commentid>16494</commentid>
    <comment_count>7</comment_count>
    <who name="Nitin Kamble">nitin.a.kamble</who>
    <bug_when>2011-09-26 17:02:25 +0000</bug_when>
    <thetext>I am not aware of this issue much, looking at the commands you are using to build, it will build for local host only. Does dpdk support specifying kernel directory for building modules? I think tom would be able to help module building part.</thetext>
  </long_desc><long_desc isprivate="0" >
    <commentid>40948</commentid>
    <comment_count>8</comment_count>
    <who name="Nitin Kamble">nitin.a.kamble</who>
    <bug_when>2014-03-06 22:33:28 +0000</bug_when>
    <thetext>This issues is obsolete now.</thetext>
  </long_desc>
      
          <attachment
              isobsolete="0"
              ispatch="0"
              isprivate="0"
          >
            <attachid>256</attachid>
            <date>2011-09-26 16:31:15 +0000</date>
            <delta_ts>2011-09-26 16:31:15 +0000</delta_ts>
            <desc>attached is the dpdk recipe</desc>
            <filename>intel-dpdk.bb</filename>
            <type>application/octet-stream</type>
            <size>699</size>
            <attacher name="kishore">kishore.k.bodke</attacher>
            
              <data encoding="base64">U1VNTUFSWSA9ICJJbnRlbCBEUERLIg0KREVTQ1JJUFRJT04gPSAiSW50ZWwgQ3J5c3RhbEZvcmVz
dCBCU1AgRGF0YSBQbGFuZSBEZXZlbG9wbWVudCBLaXQiDQpMSUNFTlNFID0gIkdQTHYyIg0KTElD
X0ZJTEVTX0NIS1NVTSA9ICJmaWxlOi8vQ09QWUlORzttZDU9MTJmODg0ZDJhZTFmZjg3YzA5ZTVi
N2NjYzJjNGNhN2UiDQoNClBSID0gcjANCg0KU1JDX1VSSSA9ICJmaWxlOi8vaW50ZWwtZHBkay50
YXIuZ3ogIg0KI1NSQ19VUkkgKz0gImZpbGU6Ly9maXhfcmVscGF0aF9zY3JpcHQucGF0Y2giDQoN
Cg0KUyA9ICIke1dPUktESVJ9L2ludGVsLWRwZGsiDQpCID0gIiR7V09SS0RJUn0vYnVpbGQtJHtU
QVJHRVRfU1lTfSINCg0KDQoNCkZMQUcgPSAiVj0xIg0KDQpFWFRSQV9PRU1BS0UgKz0gIiR7RkxB
R30iDQoNCmRvX2NvbmZpZ3VyZSAoKSB7DQoJc2V0IC14DQoJY2QgJHtTfQ0KCXVuc2V0IHByZWZp
eA0KCW1ha2UgVj0xIGNvbmZpZyBPPXg4Nl82NC1kZWZhdWx0LWxpbnV4YXBwLWdjYyBUPXg4Nl82
NC1kZWZhdWx0LWxpbnV4YXBwLWdjYw0KDQp9DQoNCg0KDQpkb19jb21waWxlKCkgew0KCQ0KCQ0K
CWNkICR7U30veDg2XzY0LWRlZmF1bHQtbGludXhhcHAtZ2NjICYmIFwNCgkNCgltYWtlIFY9MQ0K
CQ0KCQ0KfQ0KDQpGSUxFU18ke1BOfSArPSAiL3g4Nl82NC1kZWZhdWx0LWxpbnV4YXBwLWdjYy8q
Ig0KDQoNCg0KDQoNCg0K
</data>

          </attachment>
          <attachment
              isobsolete="0"
              ispatch="0"
              isprivate="0"
          >
            <attachid>257</attachid>
            <date>2011-09-26 16:42:47 +0000</date>
            <delta_ts>2011-09-26 16:42:47 +0000</delta_ts>
            <desc>patch to the recipe to fix the issue</desc>
            <filename>fix_relpath_script.patch</filename>
            <type>application/octet-stream</type>
            <size>723</size>
            <attacher name="Nitin Kamble">nitin.a.kamble</attacher>
            
              <data encoding="base64">VGhlIHByZWZpeCB2YXIgaXMgYXNzdW1lZCB1bmluaXRpYWxpemVkIGluIHRoZSBzY3JpcHQ7IGJ1
dCB0aGUgDQpwcmVmaXggdmFyIGlzIHVzZWQgdG8gZ251IHNvdXJjZXMgdG8gaW5kaWNhdGUgdGhl
IGluc3RhbGwgbG9jYXRpb24NCkluaXRpYWxpemVkIHRoZSBwcmVmaXggdmFyIHRvIGVtcHR5IHN0
cmluZyB0byBhdm9pZCB0aGUgaXNzdWUuDQoNClVwc3RyZWFtU3RhdHVzOiBJbnZhbGlkDQoyMDEx
LzA5LzI2DQpTaWduZWQtT2ZmLUJ5OiBOaXRpbiBBIEthbWJsZSA8bml0aW4uYS5rYW1ibGVAaW50
ZWwuY29tPg0KDQoNCkluZGV4OiBpbnRlbC1kcGRrL3NjcmlwdHMvcmVscGF0aC5zaA0KPT09PT09
PT09PT09PT09PT09PT09PT09PT09PT09PT09PT09PT09PT09PT09PT09PT09PT09PT09PT09PT09
PT09PQ0KLS0tIGludGVsLWRwZGsub3JpZy9zY3JpcHRzL3JlbHBhdGguc2ggIDIwMTEtMDktMjYg
MTU6MjM6MjIuNDAyMjY5OTE3IC0wNzAwDQorKysgaW50ZWwtZHBkay9zY3JpcHRzL3JlbHBhdGgu
c2ggICAgICAgMjAxMS0wOS0yNiAxNToyMzozNS45NDEyNzA0MDIgLTA3MDANCkBAIC04NSw2ICs4
NSw4IEBADQogICAgICAgIHJpZ2h0MT0ke3ByZXZfcmlnaHQxfQ0KIGZpDQoNCitwcmVmaXg9IiIN
CisNCiB3aGlsZSBbICIke3JpZ2h0Mn0iICE9ICIiIF07IGRvDQogICAgICAgIHByZWZpeD0ke3By
ZWZpeH0uLi8NCiAgICAgICAgcHJldl9yaWdodDI9JHJpZ2h0Mg0K
</data>

          </attachment>
      

    </bug>

</bugzilla>