<?xml version="1.0" encoding="UTF-8" standalone="yes" ?>
<!DOCTYPE bugzilla SYSTEM "https://bugzilla.yoctoproject.org/page.cgi?id=bugzilla.dtd">

<bugzilla version="5.0.6"
          urlbase="https://bugzilla.yoctoproject.org/"
          
          maintainer="it-coreprojects-helpdesk@linuxfoundation.org"
>

    <bug>
          <bug_id>15318</bug_id>
          
          <creation_ts>2023-12-11 18:02:57 +0000</creation_ts>
          <short_desc>AB-INT: devtool.DevtoolModifyTests.test_devtool_modify_virtual failure initial_rev not found</short_desc>
          <delta_ts>2024-06-06 14:59:59 +0000</delta_ts>
          <reporter_accessible>1</reporter_accessible>
          <cclist_accessible>1</cclist_accessible>
          <classification_id>10</classification_id>
          <classification>QA/Testing</classification>
          <product>Functional (self) Testing</product>
          <component>oe-selftest</component>
          <version>unspecified</version>
          <rep_platform>x86</rep_platform>
          <op_sys>Multiple</op_sys>
          <bug_status>RESOLVED</bug_status>
          <resolution>WORKSFORME</resolution>
          
          
          <bug_file_loc></bug_file_loc>
          <status_whiteboard>AB-INT</status_whiteboard>
          <keywords></keywords>
          <priority>Medium+</priority>
          <bug_severity>normal</bug_severity>
          <target_milestone>5.1 M2</target_milestone>
          
          
          <everconfirmed>1</everconfirmed>
          <reporter name="Alexandre Belloni">alexandre.belloni</reporter>
          <assigned_to name="Unassigned">unassigned</assigned_to>
          <cc>alexandre.belloni</cc>
    
    <cc>randy.macleod</cc>
    
    <cc>richard.purdie</cc>
    
    <cc>steve</cc>
          
          
          <cf_os>---</cf_os>
          <cf_regression_type>---</cf_regression_type>
          
          <cf_docchange>No (bug/feature does not impact docs)</cf_docchange>

      

      

      

          <comment_sort_order>oldest_to_newest</comment_sort_order>  
          <long_desc isprivate="0" >
    <commentid>97497</commentid>
    <comment_count>0</comment_count>
    <who name="Alexandre Belloni">alexandre.belloni</who>
    <bug_when>2023-12-11 18:02:57 +0000</bug_when>
    <thetext>https://autobuilder.yoctoproject.org/typhoon/#/builders/80/builds/6050/steps/14/logs/stdio

oe-selftest-debian debian11-ty-3

2023-11-25 18:19:40,171 - oe-selftest - INFO - devtool.DevtoolModifyTests.test_devtool_modify_virtual (subunit.RemotedTestCase)
2023-11-25 18:19:40,171 - oe-selftest - INFO -  ... FAIL
Stderr:
2023-11-25 17:14:30,334 - oe-selftest - INFO - Adding: &quot;include selftest.inc&quot; in /home/pokybuild/yocto-worker/oe-selftest-debian/build/build-st-4052005/conf/local.conf
2023-11-25 17:14:30,334 - oe-selftest - INFO - Adding: &quot;include bblayers.inc&quot; in bblayers.conf
2023-11-25 18:19:40,171 - oe-selftest - INFO - 3: 15/75 485/553 (8.06s) (0 failed) (devtool.DevtoolModifyTests.test_devtool_modify_virtual)
2023-11-25 18:19:40,172 - oe-selftest - INFO - testtools.testresult.real._StringException: Traceback (most recent call last):
  File &quot;/home/pokybuild/yocto-worker/oe-selftest-debian/build/meta/lib/oeqa/selftest/cases/devtool.py&quot;, line 1050, in test_devtool_modify_virtual
    result = runCmd(&apos;devtool modify %s -x %s&apos; % (virtrecipe, tempdir))
  File &quot;/home/pokybuild/yocto-worker/oe-selftest-debian/build/meta/lib/oeqa/utils/commands.py&quot;, line 212, in runCmd
    raise AssertionError(&quot;Command &apos;%s&apos; returned non-zero exit status %d:\n%s&quot; % (command, result.status, exc_output))
AssertionError: Command &apos;devtool modify virtual/make -x /tmp/devtoolqa72b902ie&apos; returned non-zero exit status 1:
NOTE: Reconnecting to bitbake server...
INFO: Creating workspace layer in /home/pokybuild/yocto-worker/oe-selftest-debian/build/build-st-4052005/workspace
NOTE: Reconnecting to bitbake server...
Loading cache...done.
Loaded 1918 entries from dependency cache.
INFO: Mapping virtual/make to make
NOTE: Resolving any missing task queue dependencies
Build Configuration:
BB_VERSION           = &quot;2.6.0&quot;
BUILD_SYS            = &quot;x86_64-linux&quot;
NATIVELSBSTRING      = &quot;universal&quot;
TARGET_SYS           = &quot;x86_64-poky-linux&quot;
MACHINE              = &quot;qemux86-64&quot;
DISTRO               = &quot;poky&quot;
DISTRO_VERSION       = &quot;4.3+snapshot-2696bf8cf35ca51b5147f6d462a1a9acea63097a&quot;
TUNE_FEATURES        = &quot;m64 core2&quot;
TARGET_FPU           = &quot;&quot;
meta                 
meta-poky            
meta-yocto-bsp       = &quot;master:2696bf8cf35ca51b5147f6d462a1a9acea63097a&quot;
meta-selftest        = &quot;master:25feb870e3b7cdb7a5878575196b5223de321efc&quot;
Initialising tasks...done.
Sstate summary: Wanted 11 Local 0 Mirrors 11 Missed 0 Current 20 (100% match, 100% complete)
NOTE: Executing Tasks
NOTE: Tasks Summary: Attempted 104 tasks of which 101 didn&apos;t need to be rerun and all succeeded.
ERROR: Something went wrong with source extraction - the devtool-source class was not active or did not function correctly:
[Errno 2] No such file or directory: &apos;/home/pokybuild/yocto-worker/oe-selftest-debian/build/build-st-4052005/tmp/work/core2-64-poky-linux/make/4.4.1/devtooltmp-5iz5wnmx/initial_rev&apos;</thetext>
  </long_desc><long_desc isprivate="0" >
    <commentid>97500</commentid>
    <comment_count>1</comment_count>
    <who name="Alexandre Belloni">alexandre.belloni</who>
    <bug_when>2023-12-11 18:26:12 +0000</bug_when>
    <thetext>https://autobuilder.yoctoproject.org/typhoon/#/builders/86/builds/6082/steps/14/logs/stdio

oe-selftest-fedora fedora38-ty-4</thetext>
  </long_desc><long_desc isprivate="0" >
    <commentid>97520</commentid>
    <comment_count>2</comment_count>
    <who name="Alexandre Belloni">alexandre.belloni</who>
    <bug_when>2023-12-11 23:17:05 +0000</bug_when>
    <thetext>https://autobuilder.yoctoproject.org/typhoon/#/builders/87/builds/5922/steps/14/logs/stdio

oe-selftest-ubuntu ubuntu2204-ty-3</thetext>
  </long_desc><long_desc isprivate="0" >
    <commentid>97521</commentid>
    <comment_count>3</comment_count>
    <who name="Alexandre Belloni">alexandre.belloni</who>
    <bug_when>2023-12-11 23:24:54 +0000</bug_when>
    <thetext>https://autobuilder.yoctoproject.org/typhoon/#/builders/127/builds/2253/steps/14/logs/stdio

oe-selftest-armhost ubuntu2204-arm-1

devtool.DevtoolExtractTests.test_devtool_reset_all</thetext>
  </long_desc><long_desc isprivate="0" >
    <commentid>97589</commentid>
    <comment_count>4</comment_count>
    <who name="Alexandre Belloni">alexandre.belloni</who>
    <bug_when>2023-12-15 23:40:56 +0000</bug_when>
    <thetext>https://autobuilder.yoctoproject.org/typhoon/#/builders/86/builds/6049/steps/14/logs/stdio

oe-selftest-fedora fedora38-ty-4</thetext>
  </long_desc><long_desc isprivate="0" >
    <commentid>98020</commentid>
    <comment_count>5</comment_count>
    <who name="Randy MacLeod">randy.macleod</who>
    <bug_when>2024-01-25 14:28:52 +0000</bug_when>
    <thetext>Bulk move of bugs owned by &quot;unassigned&quot; from 5.0-M2 to 5.0-M3.</thetext>
  </long_desc><long_desc isprivate="0" >
    <commentid>98102</commentid>
    <comment_count>6</comment_count>
    <who name="Alexandre Belloni">alexandre.belloni</who>
    <bug_when>2024-02-01 18:17:56 +0000</bug_when>
    <thetext>https://autobuilder.yoctoproject.org/typhoon/#/builders/87/builds/6003/steps/14/logs/stdio
oe-selftest-ubuntu ubuntu2204-ty-3

https://autobuilder.yoctoproject.org/typhoon/#/builders/80/builds/5838/steps/14/logs/stdio
oe-selftest-debian debian11-ty-3</thetext>
  </long_desc><long_desc isprivate="0" >
    <commentid>98103</commentid>
    <comment_count>7</comment_count>
    <who name="Alexandre Belloni">alexandre.belloni</who>
    <bug_when>2024-02-01 18:19:16 +0000</bug_when>
    <thetext>https://autobuilder.yoctoproject.org/typhoon/#/builders/97/builds/7225/steps/15/logs/stdio
qemuarm64-armhost ubuntu2204-arm-1

https://autobuilder.yoctoproject.org/typhoon/#/builders/97/builds/7206/steps/15/logs/stdio
qemuarm64-armhost ubuntu2204-arm-1</thetext>
  </long_desc><long_desc isprivate="0" >
    <commentid>98105</commentid>
    <comment_count>8</comment_count>
    <who name="Alexandre Belloni">alexandre.belloni</who>
    <bug_when>2024-02-01 18:21:05 +0000</bug_when>
    <thetext>(In reply to Alexandre Belloni from comment #7)
&gt; https://autobuilder.yoctoproject.org/typhoon/#/builders/97/builds/7225/steps/
&gt; 15/logs/stdio
&gt; qemuarm64-armhost ubuntu2204-arm-1
&gt; 
&gt; https://autobuilder.yoctoproject.org/typhoon/#/builders/97/builds/7206/steps/
&gt; 15/logs/stdio
&gt; qemuarm64-armhost ubuntu2204-arm-1

Mistake, those were 15185</thetext>
  </long_desc><long_desc isprivate="0" >
    <commentid>98545</commentid>
    <comment_count>9</comment_count>
    <who name="Steve Sakoman">steve</who>
    <bug_when>2024-03-20 21:29:30 +0000</bug_when>
    <thetext>kirkstone:

https://autobuilder.yoctoproject.org/typhoon/#/builders/86/builds/6557/steps/14/logs/stdio

oe-selftest-fedora fedora38-ty-2</thetext>
  </long_desc><long_desc isprivate="0" >
    <commentid>98546</commentid>
    <comment_count>10</comment_count>
    <who name="Steve Sakoman">steve</who>
    <bug_when>2024-03-20 21:31:51 +0000</bug_when>
    <thetext>Sigh, the above was nanbield not kirkstone</thetext>
  </long_desc><long_desc isprivate="0" >
    <commentid>98647</commentid>
    <comment_count>11</comment_count>
    <who name="Alexandre Belloni">alexandre.belloni</who>
    <bug_when>2024-03-27 22:26:19 +0000</bug_when>
    <thetext>https://autobuilder.yoctoproject.org/typhoon/#/builders/86/builds/5868/steps/14/logs/stdio

oe-selftest-fedora fedora38-ty-5</thetext>
  </long_desc><long_desc isprivate="0" >
    <commentid>98722</commentid>
    <comment_count>12</comment_count>
    <who name="Alexandre Belloni">alexandre.belloni</who>
    <bug_when>2024-04-05 21:58:29 +0000</bug_when>
    <thetext>https://autobuilder.yoctoproject.org/typhoon/#/builders/87/builds/5968/steps/14/logs/stdio

oe-selftest-ubuntu ubuntu2204-ty-3</thetext>
  </long_desc><long_desc isprivate="0" >
    <commentid>99011</commentid>
    <comment_count>13</comment_count>
    <who name="Richard Purdie">richard.purdie</who>
    <bug_when>2024-05-16 11:36:22 +0000</bug_when>
    <thetext>I compared two logs, one of the cooker from a failed build and another with a local successful test run. At one point, one invalidates the base cache whilst the other only invalidates the parse cache. I suspect an issue with changes being made to config files but mtime hasn&apos;t quite changed yet as the changes haven&apos;t made it through to the disk. I&apos;m experimenting with a patch with os.sync() in the cache check path in cooker.</thetext>
  </long_desc><long_desc isprivate="0" >
    <commentid>99143</commentid>
    <comment_count>14</comment_count>
    <who name="Randy MacLeod">randy.macleod</who>
    <bug_when>2024-06-06 14:59:59 +0000</bug_when>
    <thetext>We believe the mtime caching issues in bitbake have resolved this problem.
Re-open if seen again.</thetext>
  </long_desc>
      
      

    </bug>

</bugzilla>