<?xml version="1.0" encoding="UTF-8" standalone="yes" ?>
<!DOCTYPE bugzilla SYSTEM "https://bugzilla.yoctoproject.org/page.cgi?id=bugzilla.dtd">

<bugzilla version="5.0.6"
          urlbase="https://bugzilla.yoctoproject.org/"
          
          maintainer="it-coreprojects-helpdesk@linuxfoundation.org"
>

    <bug>
          <bug_id>15327</bug_id>
          
          <creation_ts>2023-12-16 23:20:55 +0000</creation_ts>
          <short_desc>AB-INT: ssh.SSHTest.test_ssh fails with &quot;No route to host&quot;</short_desc>
          <delta_ts>2024-11-02 22:05:37 +0000</delta_ts>
          <reporter_accessible>1</reporter_accessible>
          <cclist_accessible>1</cclist_accessible>
          <classification_id>10</classification_id>
          <classification>QA/Testing</classification>
          <product>Runtime Testing</product>
          <component>oeqa/runtime</component>
          <version>unspecified</version>
          <rep_platform>x86</rep_platform>
          <op_sys>Multiple</op_sys>
          <bug_status>RESOLVED</bug_status>
          <resolution>FIXED</resolution>
          
          
          <bug_file_loc></bug_file_loc>
          <status_whiteboard>AB-INT</status_whiteboard>
          <keywords></keywords>
          <priority>Medium+</priority>
          <bug_severity>normal</bug_severity>
          <target_milestone>5.99</target_milestone>
          
          
          <everconfirmed>1</everconfirmed>
          <reporter name="Alexandre Belloni">alexandre.belloni</reporter>
          <assigned_to name="Unassigned">unassigned</assigned_to>
          <cc>alexandre.belloni</cc>
    
    <cc>chee.yang.lee</cc>
    
    <cc>mathieu.dubois-briand</cc>
    
    <cc>randy.macleod</cc>
    
    <cc>richard.purdie</cc>
          
          
          <cf_os>---</cf_os>
          <cf_regression_type>---</cf_regression_type>
          
          <cf_docchange>No (bug/feature does not impact docs)</cf_docchange>

      

      

      

          <comment_sort_order>oldest_to_newest</comment_sort_order>  
          <long_desc isprivate="0" >
    <commentid>97593</commentid>
    <comment_count>0</comment_count>
    <who name="Alexandre Belloni">alexandre.belloni</who>
    <bug_when>2023-12-16 23:20:55 +0000</bug_when>
    <thetext>https://autobuilder.yoctoproject.org/typhoon/#/builders/82/builds/5857/steps/12/logs/stdio

This failed with a bunch:
RESULTS - ssh.SSHTest.test_ssh: FAILED (477.53s)
SUMMARY:
core-image-ptest-libtest-needs-perl () - Ran 6 tests in 477.562s
core-image-ptest-libtest-needs-perl - FAIL - Required tests failed (successes=2, skipped=3, failures=1, errors=0)
ERROR: core-image-ptest-libtest-needs-perl-1.0-r0 do_testimage: core-image-ptest-libtest-needs-perl - FAILED - also check the logs in /home/pokybuild/yocto-worker/qemuarm64-ptest/build/build/tmp/log
ERROR: Logfile of failure stored in: /home/pokybuild/yocto-worker/qemuarm64-ptest/build/build/tmp/work/qemuarm64-poky-linux/core-image-ptest-libtest-needs-perl/1.0/temp/log.do_testimage.3497123
NOTE: recipe core-image-ptest-libtest-needs-perl-1.0-r0: task do_testimage: Failed
ERROR: Task (virtual:mcextend:libtest-needs-perl:/home/pokybuild/yocto-worker/qemuarm64-ptest/build/meta/recipes-core/images/core-image-ptest.bb:do_testimage) failed with exit code &apos;1&apos;
NOTE: Pressure status changed to CPU: True, IO: True, Mem: None (CPU: 14694.4/10000.0, IO: 892491.2/10000.0, Mem: 0.0/None) - using 8/16 bitbake threads
Traceback (most recent call last):
  File &quot;/home/pokybuild/yocto-worker/qemuarm64-ptest/build/meta/lib/oeqa/core/decorator/__init__.py&quot;, line 35, in wrapped_f
    return func(*args, **kwargs)
  File &quot;/home/pokybuild/yocto-worker/qemuarm64-ptest/build/meta/lib/oeqa/core/decorator/__init__.py&quot;, line 35, in wrapped_f
    return func(*args, **kwargs)
  File &quot;/home/pokybuild/yocto-worker/qemuarm64-ptest/build/meta/lib/oeqa/runtime/cases/ssh.py&quot;, line 20, in test_ssh
    self.assertEqual(status, 0, msg=&apos;SSH Test failed: %s&apos; % output)
AssertionError: 255 != 0 : SSH Test failed: ssh: connect to host 192.168.7.2 port 22: No route to host</thetext>
  </long_desc><long_desc isprivate="0" >
    <commentid>97594</commentid>
    <comment_count>1</comment_count>
    <who name="Alexandre Belloni">alexandre.belloni</who>
    <bug_when>2023-12-16 23:23:40 +0000</bug_when>
    <thetext>RP investigated and said:

10:13:53             RP | abelloni: can you see a timestamp for when it happened
10:13:54             RP | ?
10:14:35       abelloni | 1702627323
10:14:52       abelloni | $ LC_TIME=C date -u -d @1702627323
10:14:55       abelloni | Fri Dec 15 08:02:03 UTC 2023
10:15:29       abelloni | Thu Dec 14 23:11:30 UTC 2023
10:15:37       abelloni | between those times
10:16:33             RP | at 6:24 there is a systemd-networkd-wait-online: Timeout occurred waiting for network connectivity
10:18:50             RP | was part of an apt update. Nothing else I can see
10:22:13             RP | abelloni: I think networkd probably did something :/</thetext>
  </long_desc><long_desc isprivate="0" >
    <commentid>97595</commentid>
    <comment_count>2</comment_count>
    <who name="Alexandre Belloni">alexandre.belloni</who>
    <bug_when>2023-12-16 23:32:00 +0000</bug_when>
    <thetext>https://autobuilder.yoctoproject.org/typhoon/#/builders/93/builds/1831/steps/12/logs/stdio

qemuarm64-ptest-fast ubuntu2204-arm-1</thetext>
  </long_desc><long_desc isprivate="0" >
    <commentid>97596</commentid>
    <comment_count>3</comment_count>
    <who name="Alexandre Belloni">alexandre.belloni</who>
    <bug_when>2023-12-16 23:33:58 +0000</bug_when>
    <thetext>This one was running between:

Fri Dec 15 01:07:14 UTC 2023
Fri Dec 15 03:12:39 UTC 2023</thetext>
  </long_desc><long_desc isprivate="0" >
    <commentid>97605</commentid>
    <comment_count>4</comment_count>
    <who name="Chee Yang">chee.yang.lee</who>
    <bug_when>2023-12-18 06:29:25 +0000</bug_when>
    <thetext>https://autobuilder.yoctoproject.org/typhoon/#/builders/82/builds/5869/steps/12/logs/stdio
ubuntu2204-arm-1  qemuarm64-ptest</thetext>
  </long_desc><long_desc isprivate="0" >
    <commentid>97608</commentid>
    <comment_count>5</comment_count>
    <who name="Alexandre Belloni">alexandre.belloni</who>
    <bug_when>2023-12-18 17:07:03 +0000</bug_when>
    <thetext>https://autobuilder.yoctoproject.org/typhoon/#/builders/82/builds/5869/steps/12/logs/stdio

qemuarm64-ptest ubuntu2204-arm-1</thetext>
  </long_desc><long_desc isprivate="0" >
    <commentid>97634</commentid>
    <comment_count>6</comment_count>
    <who name="Randy MacLeod">randy.macleod</who>
    <bug_when>2023-12-21 15:42:19 +0000</bug_when>
    <thetext>Just looks like the networking went dead. Systemd-networkd notes a change in carrier but it&apos;s not clear if our log message happens before that log.</thetext>
  </long_desc><long_desc isprivate="0" >
    <commentid>97999</commentid>
    <comment_count>7</comment_count>
    <who name="Randy MacLeod">randy.macleod</who>
    <bug_when>2024-01-25 14:28:47 +0000</bug_when>
    <thetext>Bulk move of bugs owned by &quot;unassigned&quot; from 5.0-M2 to 5.0-M3.</thetext>
  </long_desc><long_desc isprivate="0" >
    <commentid>98302</commentid>
    <comment_count>8</comment_count>
    <who name="Randy MacLeod">randy.macleod</who>
    <bug_when>2024-02-22 19:53:23 +0000</bug_when>
    <thetext>Bulk move of bugs from 5.0-M3 to 5.99.
The bugs in this list are all unassigned and are ones that I consider to be nice to do some time but not essential track from milestone to milestone in 5.0 or 5.1. We agreed on this bug handling approach in the YP bug review on Feb 22, 2024.

If you disagree, please move back to a 5.[012...]-M* milestone.</thetext>
  </long_desc><long_desc isprivate="0" >
    <commentid>99854</commentid>
    <comment_count>9</comment_count>
    <who name="Mathieu Dubois-Briand">mathieu.dubois-briand</who>
    <bug_when>2024-10-14 06:18:01 +0000</bug_when>
    <thetext>no-x11 debian12-ty-1
https://autobuilder.yoctoproject.org/typhoon/#/builders/40/builds/9549/steps/15/logs/stdio</thetext>
  </long_desc><long_desc isprivate="0" >
    <commentid>99883</commentid>
    <comment_count>10</comment_count>
    <who name="Mathieu Dubois-Briand">mathieu.dubois-briand</who>
    <bug_when>2024-10-16 15:43:00 +0000</bug_when>
    <thetext>oe-selftest-debian debian11-vk-2
https://valkyrie.yoctoproject.org/#/builders/35/builds/176/steps/14/logs/stdio

oe-selftest-debian debian11-vk-3
https://valkyrie.yoctoproject.org/#/builders/35/builds/178/steps/14/logs/stdio

oe-selftest-debian debian11-vk-2
https://valkyrie.yoctoproject.org/#/builders/35/builds/182/steps/14/logs/stdio

oe-selftest-debian debian11-vk-2
https://valkyrie.yoctoproject.org/#/builders/35/builds/229/steps/14/logs/stdio

oe-selftest-debian debian11-vk-3
https://valkyrie.yoctoproject.org/#/builders/35/builds/238/steps/14/logs/stdio</thetext>
  </long_desc><long_desc isprivate="0" >
    <commentid>99986</commentid>
    <comment_count>11</comment_count>
    <who name="Randy MacLeod">randy.macleod</who>
    <bug_when>2024-10-24 14:48:51 +0000</bug_when>
    <thetext>The debian11 issues should be fixed by changing to the 6.1 kernel. 
Waiting to see if debian12 happens again.</thetext>
  </long_desc><long_desc isprivate="0" >
    <commentid>100098</commentid>
    <comment_count>12</comment_count>
    <who name="Richard Purdie">richard.purdie</who>
    <bug_when>2024-11-02 22:05:37 +0000</bug_when>
    <thetext>No recurrences reported so closing.</thetext>
  </long_desc>
      
      

    </bug>

</bugzilla>