<?xml version="1.0" encoding="UTF-8" standalone="yes" ?>
<!DOCTYPE bugzilla SYSTEM "https://bugzilla.yoctoproject.org/page.cgi?id=bugzilla.dtd">

<bugzilla version="5.0.6"
          urlbase="https://bugzilla.yoctoproject.org/"
          
          maintainer="it-coreprojects-helpdesk@linuxfoundation.org"
>

    <bug>
          <bug_id>15460</bug_id>
          
          <creation_ts>2024-03-27 20:41:01 +0000</creation_ts>
          <short_desc>AB-INT: toaster test failures</short_desc>
          <delta_ts>2024-10-24 10:26:19 +0000</delta_ts>
          <reporter_accessible>1</reporter_accessible>
          <cclist_accessible>1</cclist_accessible>
          <classification_id>10</classification_id>
          <classification>QA/Testing</classification>
          <product>Functional (self) Testing</product>
          <component>general</component>
          <version>unspecified</version>
          <rep_platform>x86</rep_platform>
          <op_sys>Multiple</op_sys>
          <bug_status>RESOLVED</bug_status>
          <resolution>FIXED</resolution>
          
          
          <bug_file_loc></bug_file_loc>
          <status_whiteboard>AB-INT</status_whiteboard>
          <keywords></keywords>
          <priority>Medium</priority>
          <bug_severity>normal</bug_severity>
          <target_milestone>5.2</target_milestone>
          
          
          <everconfirmed>1</everconfirmed>
          <reporter name="Alexandre Belloni">alexandre.belloni</reporter>
          <assigned_to name="Unassigned">unassigned</assigned_to>
          <cc>alexandre.belloni</cc>
    
    <cc>mathieu.dubois-briand</cc>
    
    <cc>randy.macleod</cc>
    
    <cc>richard.purdie</cc>
    
    <cc>tim.orling</cc>
          
          
          <cf_os>---</cf_os>
          <cf_regression_type>---</cf_regression_type>
          
          <cf_docchange>No (bug/feature does not impact docs)</cf_docchange>

      

      

      

          <comment_sort_order>oldest_to_newest</comment_sort_order>  
          <long_desc isprivate="0" >
    <commentid>98631</commentid>
    <comment_count>0</comment_count>
    <who name="Alexandre Belloni">alexandre.belloni</who>
    <bug_when>2024-03-27 20:41:01 +0000</bug_when>
    <thetext>Suddenly, we got two toaster test failures:

https://autobuilder.yoctoproject.org/typhoon/#/builders/161/builds/237/steps/11/logs/stdio

fedora38-ty-2


FAILED ../bitbake/lib/toaster/tests/browser/test_all_builds_page.py::TestAllBuildsPage::test_builds_table_editColumn
FAILED ../bitbake/lib/toaster/tests/browser/test_all_builds_page.py::TestAllBuildsPage::test_builds_table_search_box
FAILED ../bitbake/lib/toaster/tests/browser/test_all_builds_page.py::TestAllBuildsPage::test_builds_table_show_rows
FAILED ../bitbake/lib/toaster/tests/browser/test_all_builds_page.py::TestAllBuildsPage::test_builds_time_links
FAILED ../bitbake/lib/toaster/tests/browser/test_all_builds_page.py::TestAllBuildsPage::test_filtering_on_completedOn_column
FAILED ../bitbake/lib/toaster/tests/browser/test_all_builds_page.py::TestAllBuildsPage::test_filtering_on_failure_tasks_column
FAILED ../bitbake/lib/toaster/tests/browser/test_all_builds_page.py::TestAllBuildsPage::test_rebuild_buttons
FAILED ../bitbake/lib/toaster/tests/browser/test_all_builds_page.py::TestAllBuildsPage::test_show_tasks_with_suffix
FAILED ../bitbake/lib/toaster/tests/browser/test_all_builds_page.py::TestAllBuildsPage::test_tooltips_on_project_name
FAILED ../bitbake/lib/toaster/tests/browser/test_project_config_page.py::TestProjectConfigsPage::test_checkbox_verification
FAILED ../bitbake/lib/toaster/tests/browser/test_project_config_page.py::TestProjectConfigsPage::test_no_underscore_iamgefs_type
FAILED ../bitbake/lib/toaster/tests/browser/test_project_config_page.py::TestProjectConfigsPage::test_set_download_dir
FAILED ../bitbake/lib/toaster/tests/browser/test_project_config_page.py::TestProjectConfigsPage::test_set_sstate_dir
FAILED ../bitbake/lib/toaster/tests/browser/test_project_config_page.py::TestProjectConfigsPage::test_textbox_with_checkbox_verification


https://autobuilder.yoctoproject.org/typhoon/#/builders/161/builds/236/steps/11/logs/stdio

fedora38-ty-6


../bitbake/lib/toaster/tests/functional/test_project_page.py:393: IndexError</thetext>
  </long_desc><long_desc isprivate="0" >
    <commentid>98656</commentid>
    <comment_count>1</comment_count>
    <who name="Randy MacLeod">randy.macleod</who>
    <bug_when>2024-03-28 14:46:49 +0000</bug_when>
    <thetext>First occurrence.</thetext>
  </long_desc><long_desc isprivate="0" >
    <commentid>98726</commentid>
    <comment_count>2</comment_count>
    <who name="Alexandre Belloni">alexandre.belloni</who>
    <bug_when>2024-04-08 09:47:02 +0000</bug_when>
    <thetext>https://autobuilder.yoctoproject.org/typhoon/#/builders/161/builds/185/steps/11/logs/stdio</thetext>
  </long_desc><long_desc isprivate="0" >
    <commentid>99648</commentid>
    <comment_count>3</comment_count>
    <who name="Mathieu Dubois-Briand">mathieu.dubois-briand</who>
    <bug_when>2024-09-12 08:23:33 +0000</bug_when>
    <thetext>Several toaster failures:

selenium.common.exceptions.TimeoutException: Message: timeout: Timed out receiving message from renderer: 300.000
https://autobuilder.yoctoproject.org/typhoon/#/builders/161/builds/404/steps/12/logs/stdio

selenium.common.exceptions.ElementNotInteractableException: Message: element not interactable
https://autobuilder.yoctoproject.org/typhoon/#/builders/161/builds/401/steps/12/logs/stdio

selenium.common.exceptions.WebDriverException: Message: unknown error: unhandled inspector error: {&quot;code&quot;:-32000,&quot;message&quot;:&quot;Node with given id does not belong to the document&quot;}
https://autobuilder.yoctoproject.org/typhoon/#/builders/161/builds/383/steps/11/logs/stdio

selenium.common.exceptions.TimeoutException: Message: An element matching &quot;#latest-builds&quot; should be visible
https://autobuilder.yoctoproject.org/typhoon/#/builders/161/builds/382/steps/12/logs/stdio</thetext>
  </long_desc><long_desc isprivate="0" >
    <commentid>99679</commentid>
    <comment_count>4</comment_count>
    <who name="Mathieu Dubois-Briand">mathieu.dubois-briand</who>
    <bug_when>2024-09-20 09:59:05 +0000</bug_when>
    <thetext>E       selenium.common.exceptions.WebDriverException: Message: unknown error: net::ERR_CONNECTION_REFUSED
https://autobuilder.yoctoproject.org/typhoon/#/builders/161/builds/179/steps/11/logs/stdio

E       selenium.common.exceptions.WebDriverException: Message: unknown error: session deleted because of page crash
https://autobuilder.yoctoproject.org/typhoon/#/builders/161/builds/180/steps/11/logs/stdio

E       selenium.common.exceptions.WebDriverException: Message: unknown error: net::ERR_CONNECTION_REFUSED
https://autobuilder.yoctoproject.org/typhoon/#/builders/161/builds/274/steps/11/logs/stdio

E       selenium.common.exceptions.WebDriverException: Message: tab crashed
https://autobuilder.yoctoproject.org/typhoon/#/builders/161/builds/290/steps/11/logs/stdio

E       selenium.common.exceptions.WebDriverException: Message: unknown error: unhandled inspector error: {&quot;code&quot;:-32000,&quot;message&quot;:&quot;Node with given id does not belong to the document&quot;}
https://autobuilder.yoctoproject.org/typhoon/#/builders/161/builds/301/steps/12/logs/stdio

E       selenium.common.exceptions.TimeoutException: Message: An element matching &quot;#hint-error-project-name&quot; should be on the page
https://autobuilder.yoctoproject.org/typhoon/#/builders/161/builds/349/steps/12/logs/stdio

E       selenium.common.exceptions.WebDriverException: Message: unknown error: net::ERR_CONNECTION_REFUSED
https://autobuilder.yoctoproject.org/typhoon/#/builders/161/builds/351/steps/11/logs/stdio

E       selenium.common.exceptions.ElementNotInteractableException: Message: element not interactable
https://autobuilder.yoctoproject.org/typhoon/#/builders/161/builds/354/steps/11/logs/stdio

E       selenium.common.exceptions.WebDriverException: Message: tab crashed
https://autobuilder.yoctoproject.org/typhoon/#/builders/161/builds/358/steps/11/logs/stdio

E       selenium.common.exceptions.TimeoutException: Message: An element matching &quot;#hint-error-project-name&quot; should be on the page
https://autobuilder.yoctoproject.org/typhoon/#/builders/161/builds/417/steps/12/logs/stdio

E       selenium.common.exceptions.WebDriverException: Message: unknown error: unhandled inspector error: {&quot;code&quot;:-32000,&quot;message&quot;:&quot;Node with given id does not belong to the document&quot;}
https://autobuilder.yoctoproject.org/typhoon/#/builders/161/builds/420/steps/11/logs/stdio

E   AssertionError: None is not true : The project release is not defined
https://autobuilder.yoctoproject.org/typhoon/#/builders/161/builds/421/steps/11/logs/stdio

self.assertTrue(
    f&apos;You have removed 1 layer from your project&apos; in str(change_notification.text)
            )
E       AssertionError: False is not true
https://autobuilder.yoctoproject.org/typhoon/#/builders/161/builds/422/steps/11/logs/stdio

self.assertTrue(
    f&apos;You have removed 1 layer from your project&apos; in str(change_notification.text)
            )
E       AssertionError: False is not true
https://autobuilder.yoctoproject.org/typhoon/#/builders/161/builds/423/steps/11/logs/stdio</thetext>
  </long_desc><long_desc isprivate="0" >
    <commentid>99685</commentid>
    <comment_count>5</comment_count>
    <who name="Mathieu Dubois-Briand">mathieu.dubois-briand</who>
    <bug_when>2024-09-23 15:08:38 +0000</bug_when>
    <thetext>E       selenium.common.exceptions.TimeoutException: Message: timeout: Timed out receiving message from renderer: 600.000
https://autobuilder.yoctoproject.org/typhoon/#/builders/161/builds/424/steps/11/logs/stdio</thetext>
  </long_desc><long_desc isprivate="0" >
    <commentid>99734</commentid>
    <comment_count>6</comment_count>
    <who name="Tim Orling">tim.orling</who>
    <bug_when>2024-09-26 15:17:19 +0000</bug_when>
    <thetext>Errors on valkyrie:
https://valkyrie.yoctoproject.org/#/builders/88/builds/6

FAILED ../bitbake/lib/toaster/tests/browser/test_landing_page.py::TestLandingPage::test_icon_info_visible_and_clickable
FAILED ../bitbake/lib/toaster/tests/functional/test_functional_basic.py::FuntionalTestBasic::test_review_configuration_information</thetext>
  </long_desc><long_desc isprivate="0" >
    <commentid>99852</commentid>
    <comment_count>7</comment_count>
    <who name="Mathieu Dubois-Briand">mathieu.dubois-briand</who>
    <bug_when>2024-10-14 06:17:05 +0000</bug_when>
    <thetext>toaster ubuntu2204-vk-1
E       selenium.common.exceptions.WebDriverException: Message: unknown error: unhandled inspector error: {&quot;code&quot;:-32000,&quot;message&quot;:&quot;Node with given id does not belong to the document&quot;}
https://valkyrie.yoctoproject.org/#/builders/88/builds/12/steps/11/logs/stdio

toaster ubuntu2204-vk-2
E       selenium.common.exceptions.WebDriverException: Message: unknown error: unhandled inspector error: {&quot;code&quot;:-32000,&quot;message&quot;:&quot;Node with given id does not belong to the document&quot;}
https://valkyrie.yoctoproject.org/#/builders/88/builds/14/steps/11/logs/stdio

toaster ubuntu2004-vk-3
E       AttributeError: &apos;str&apos; object has no attribute &apos;removeprefix&apos;
https://valkyrie.yoctoproject.org/#/builders/88/builds/25/steps/11/logs/stdio</thetext>
  </long_desc><long_desc isprivate="0" >
    <commentid>99880</commentid>
    <comment_count>8</comment_count>
    <who name="Mathieu Dubois-Briand">mathieu.dubois-briand</who>
    <bug_when>2024-10-16 11:54:26 +0000</bug_when>
    <thetext>toaster ubuntu2410-vk-1
E       selenium.common.exceptions.WebDriverException: Message: unknown error: unhandled inspector error: {&quot;code&quot;:-32000,&quot;message&quot;:&quot;Node with given id does not belong to the document&quot;}
https://valkyrie.yoctoproject.org/#/builders/88/builds/32/steps/11/logs/stdio</thetext>
  </long_desc><long_desc isprivate="0" >
    <commentid>99889</commentid>
    <comment_count>9</comment_count>
    <who name="Mathieu Dubois-Briand">mathieu.dubois-briand</who>
    <bug_when>2024-10-16 15:44:26 +0000</bug_when>
    <thetext>toaster ubuntu2204-vk-2
E       selenium.common.exceptions.WebDriverException: Message: unknown error:
unhandled inspector error: {&quot;code&quot;:-32000,&quot;message&quot;:&quot;Node with given id does not
belong to the document&quot;}
https://valkyrie.yoctoproject.org/#/builders/88/builds/8/steps/11/logs/stdio

toaster ubuntu2204-vk-2
E       AssertionError: False is not true : Allert message not shown
https://valkyrie.yoctoproject.org/#/builders/88/builds/9/steps/11/logs/stdio

toaster ubuntu2204-vk-2
E       selenium.common.exceptions.WebDriverException: Message: unknown error:
unhandled inspector error: {&quot;code&quot;:-32000,&quot;message&quot;:&quot;Node with given id does not
belong to the document&quot;}
https://valkyrie.yoctoproject.org/#/builders/88/builds/13/steps/11/logs/stdio

toaster ubuntu2204-vk-1
E       AssertionError: False is not true
https://valkyrie.yoctoproject.org/#/builders/88/builds/16/steps/11/logs/stdio

toaster ubuntu2204-vk-1
selenium.common.exceptions.TimeoutException: Message: An element matching
&quot;#select-machine-form&quot; should be visible
https://valkyrie.yoctoproject.org/#/builders/88/builds/18/steps/11/logs/stdio

toaster ubuntu2004-vk-3
E       AttributeError: &apos;str&apos; object has no attribute &apos;removeprefix&apos;
https://valkyrie.yoctoproject.org/#/builders/88/builds/22/steps/11/logs/stdio

toaster ubuntu2004-vk-3
E       selenium.common.exceptions.TimeoutException: Message: An element
matching &quot;#new-project-name&quot; should be visible
https://valkyrie.yoctoproject.org/#/builders/88/builds/24/steps/11/logs/stdio

toaster fedora38-ty-6
E       AssertionError: False is not true
https://autobuilder.yoctoproject.org/typhoon/#/builders/161/builds/438/steps/11/logs/stdio

toaster ubuntu2304-ty-1
E       AssertionError: False is not true
https://autobuilder.yoctoproject.org/typhoon/#/builders/161/builds/439/steps/11/logs/stdio

toaster opensuse154-ty-2
E       AssertionError: False is not true : Allert message not shown
https://autobuilder.yoctoproject.org/typhoon/#/builders/161/builds/440/steps/12/logs/stdio

toaster ubuntu2304-ty-1
E       selenium.common.exceptions.NoSuchElementException: Message: no such
element: Unable to locate element: {&quot;method&quot;:&quot;css
selector&quot;,&quot;selector&quot;:&quot;#projectversion&quot;}
https://autobuilder.yoctoproject.org/typhoon/#/builders/161/builds/441/steps/11/logs/stdio

toaster opensuse154-ty-1
E       AssertionError: False is not true : Allert message not shown 
https://autobuilder.yoctoproject.org/typhoon/#/builders/161/builds/442/steps/12/logs/stdio

toaster fedora38-ty-6
E       AssertionError: False is not true : Allert message not shown
https://autobuilder.yoctoproject.org/typhoon/#/builders/161/builds/447/steps/11/logs/stdio

toaster opensuse154-ty-1
E       selenium.common.exceptions.TimeoutException: Message: An element
matching &quot;#hint-error-project-name&quot; should be on the page
https://autobuilder.yoctoproject.org/typhoon/#/builders/161/builds/448/steps/12/logs/stdio

toaster opensuse154-ty-1
E       AssertionError: False is not true : Allert message not shown
https://autobuilder.yoctoproject.org/typhoon/#/builders/161/builds/449/steps/12/logs/stdio

toaster ubuntu2304-ty-1
E       AssertionError: False is not true : Allert message not shown
https://autobuilder.yoctoproject.org/typhoon/#/builders/161/builds/451/steps/11/logs/stdio</thetext>
  </long_desc><long_desc isprivate="0" >
    <commentid>99902</commentid>
    <comment_count>10</comment_count>
    <who name="Mathieu Dubois-Briand">mathieu.dubois-briand</who>
    <bug_when>2024-10-17 14:23:47 +0000</bug_when>
    <thetext>toaster ubuntu2204-vk-3
E       selenium.common.exceptions.WebDriverException: Message: unknown error: unhandled inspector error: {&quot;code&quot;:-32000,&quot;message&quot;:&quot;Node with given id does not belong to the document&quot;}
https://valkyrie.yoctoproject.org/#/builders/88/builds/33/steps/11/logs/stdio</thetext>
  </long_desc><long_desc isprivate="0" >
    <commentid>99955</commentid>
    <comment_count>11</comment_count>
    <who name="Mathieu Dubois-Briand">mathieu.dubois-briand</who>
    <bug_when>2024-10-21 07:52:36 +0000</bug_when>
    <thetext>toaster ubuntu2404-vk-2
E       selenium.common.exceptions.ElementNotInteractableException: Message: element not interactable
https://valkyrie.yoctoproject.org/#/builders/88/builds/40/steps/11/logs/stdio</thetext>
  </long_desc><long_desc isprivate="0" >
    <commentid>99973</commentid>
    <comment_count>12</comment_count>
    <who name="Mathieu Dubois-Briand">mathieu.dubois-briand</who>
    <bug_when>2024-10-23 08:45:14 +0000</bug_when>
    <thetext>toaster ubuntu2404-vk-2
E       selenium.common.exceptions.ElementNotInteractableException: Message: element not interactable
https://valkyrie.yoctoproject.org/#/builders/88/builds/107/steps/11/logs/stdio</thetext>
  </long_desc><long_desc isprivate="0" >
    <commentid>99981</commentid>
    <comment_count>13</comment_count>
    <who name="Richard Purdie">richard.purdie</who>
    <bug_when>2024-10-24 10:26:19 +0000</bug_when>
    <thetext>I&apos;ve merged the toaster test suite improvements:

https://git.yoctoproject.org/poky/commit/?id=0fac8e96f73dc3cd885f2590615e0e52aab42786

I&apos;d like to open a new bug for any subsequent failures as they will likely be different to the ones in this bug and we need to track whatever is left separately.</thetext>
  </long_desc>
      
      

    </bug>

</bugzilla>