<?xml version="1.0" encoding="UTF-8" standalone="yes" ?>
<!DOCTYPE bugzilla SYSTEM "https://bugzilla.yoctoproject.org/page.cgi?id=bugzilla.dtd">

<bugzilla version="5.0.6"
          urlbase="https://bugzilla.yoctoproject.org/"
          
          maintainer="it-coreprojects-helpdesk@linuxfoundation.org"
>

    <bug>
          <bug_id>15467</bug_id>
          
          <creation_ts>2024-04-08 08:21:33 +0000</creation_ts>
          <short_desc>AB-INT PTEST: tcl ptest failure: in http11.test</short_desc>
          <delta_ts>2026-04-09 21:54:23 +0000</delta_ts>
          <reporter_accessible>1</reporter_accessible>
          <cclist_accessible>1</cclist_accessible>
          <classification_id>10</classification_id>
          <classification>QA/Testing</classification>
          <product>Package Testing (ptest)</product>
          <component>ptest</component>
          <version>unspecified</version>
          <rep_platform>x86</rep_platform>
          <op_sys>Multiple</op_sys>
          <bug_status>RESOLVED</bug_status>
          <resolution>FIXED</resolution>
          
          
          <bug_file_loc></bug_file_loc>
          <status_whiteboard>AB-INT</status_whiteboard>
          <keywords></keywords>
          <priority>Medium</priority>
          <bug_severity>normal</bug_severity>
          <target_milestone>5.3</target_milestone>
          
          
          <everconfirmed>1</everconfirmed>
          <reporter name="João Marcos Costa">joaomarcos.costa</reporter>
          <assigned_to name="Ross Burton">ross.burton</assigned_to>
          <cc>randy.macleod</cc>
    
    <cc>yoann.congal</cc>
          
          
          <cf_os>---</cf_os>
          <cf_regression_type>---</cf_regression_type>
          
          <cf_docchange>Don&apos;t know</cf_docchange>

      

      

      

          <comment_sort_order>oldest_to_newest</comment_sort_order>  
          <long_desc isprivate="0" >
    <commentid>98725</commentid>
    <comment_count>0</comment_count>
    <who name="João Marcos Costa">joaomarcos.costa</who>
    <bug_when>2024-04-08 08:21:33 +0000</bug_when>
    <thetext>https://autobuilder.yoctoproject.org/typhoon/#/builders/82/builds/6287/steps/12/logs/stdio

AssertionError: 
Failed ptests:
{&apos;tcl&apos;: [&apos;http11.test&apos;]}

qemuarm64-ptest ubuntu2004-arm-1</thetext>
  </long_desc><long_desc isprivate="0" >
    <commentid>100838</commentid>
    <comment_count>1</comment_count>
    <who name="João Marcos Costa">joaomarcos.costa</who>
    <bug_when>2025-02-04 10:34:52 +0000</bug_when>
    <thetext>https://autobuilder.yoctoproject.org/valkyrie/#/builders/61/builds/806/steps/12/logs/stdio

qemuarm64-ptest ubuntu2404-vk-arm2</thetext>
  </long_desc><long_desc isprivate="0" >
    <commentid>100882</commentid>
    <comment_count>2</comment_count>
    <who name="João Marcos Costa">joaomarcos.costa</who>
    <bug_when>2025-02-07 12:41:30 +0000</bug_when>
    <thetext>https://autobuilder.yoctoproject.org/valkyrie/#/builders/73/builds/641/steps/12/logs/stdio

qemux86-64-ptest debian12-vk-8</thetext>
  </long_desc><long_desc isprivate="0" >
    <commentid>101146</commentid>
    <comment_count>3</comment_count>
    <who name="João Marcos Costa">joaomarcos.costa</who>
    <bug_when>2025-02-18 14:33:20 +0000</bug_when>
    <thetext>https://autobuilder.yoctoproject.org/valkyrie/#/builders/61/builds/594/steps/12/logs/stdio

qemuarm64-ptest ubuntu2404-vk-arm1</thetext>
  </long_desc><long_desc isprivate="0" >
    <commentid>101148</commentid>
    <comment_count>4</comment_count>
    <who name="João Marcos Costa">joaomarcos.costa</who>
    <bug_when>2025-02-18 14:33:58 +0000</bug_when>
    <thetext>https://autobuilder.yoctoproject.org/valkyrie/#/builders/73/builds/595/steps/12/logs/stdio

qemux86-64-ptest ubuntu2204-vk-3</thetext>
  </long_desc><long_desc isprivate="0" >
    <commentid>101149</commentid>
    <comment_count>5</comment_count>
    <who name="João Marcos Costa">joaomarcos.costa</who>
    <bug_when>2025-02-18 14:40:08 +0000</bug_when>
    <thetext>https://autobuilder.yoctoproject.org/valkyrie/#/builders/73/builds/613/steps/13/logs/stdio

qemux86-64-ptest opensuse155-vk-1</thetext>
  </long_desc><long_desc isprivate="0" >
    <commentid>101225</commentid>
    <comment_count>6</comment_count>
    <who name="João Marcos Costa">joaomarcos.costa</who>
    <bug_when>2025-02-25 13:30:45 +0000</bug_when>
    <thetext>https://autobuilder.yoctoproject.org/valkyrie/#/builders/61/builds/1005/steps/12/logs/stdio

qemuarm64-ptest ubuntu2004-vk-arm2</thetext>
  </long_desc><long_desc isprivate="0" >
    <commentid>101587</commentid>
    <comment_count>7</comment_count>
    <who name="João Marcos Costa">joaomarcos.costa</who>
    <bug_when>2025-04-08 08:14:05 +0000</bug_when>
    <thetext>https://autobuilder.yoctoproject.org/valkyrie/#/builders/61/builds/1276/steps/12/logs/stdio

qemuarm64-ptest ubuntu2204-vk-arm1</thetext>
  </long_desc><long_desc isprivate="0" >
    <commentid>101654</commentid>
    <comment_count>8</comment_count>
    <who name="João Marcos Costa">joaomarcos.costa</who>
    <bug_when>2025-04-16 08:16:29 +0000</bug_when>
    <thetext>https://autobuilder.yoctoproject.org/valkyrie/#/builders/73/builds/1316/steps/12/logs/stdio

qemux86-64-ptest ubuntu2204-vk-4</thetext>
  </long_desc><long_desc isprivate="0" >
    <commentid>101672</commentid>
    <comment_count>9</comment_count>
    <who name="Ross Burton">ross.burton</who>
    <bug_when>2025-04-17 14:52:46 +0000</bug_when>
    <thetext>http11.test
==== Test with ThreadLevel 0 ====
==== Test with ThreadLevel 1 ====


==== http11-2.12.1 -channel,negotiate,keepalive FAILED
==== Contents of test case:

    set tok [http::geturl http://localhost:$httpd_port/testdoc.html  -timeout 5000 -channel $chan -keepalive 1]
    http::wait $tok
    seek $chan 0
    set data [read $chan]
    list [http::status $tok] [http::code $tok] [check_crc $tok $data] [meta $tok connection] [meta $tok content-encoding] [meta $tok transfer-encoding] [m
eta $tok x-requested-encodings] [expr {[file size testdoc.html]-[file size testfile.tmp]}]

---- Result was:
eof {} {crc32 mismatch:  ne 0} {} {} {} {} 130034
---- Result should have been (exact matching):
ok {HTTP/1.1 200 OK} ok {} gzip chunked gzip,deflate 0
==== http11-2.12.1 FAILED</thetext>
  </long_desc><long_desc isprivate="0" >
    <commentid>101871</commentid>
    <comment_count>10</comment_count>
    <who name="João Marcos Costa">joaomarcos.costa</who>
    <bug_when>2025-05-05 07:39:39 +0000</bug_when>
    <thetext>https://autobuilder.yoctoproject.org/valkyrie/#/builders/61/builds/1421/steps/13/logs/stdio

qemuarm64-ptest ubuntu2004-vk-arm2</thetext>
  </long_desc><long_desc isprivate="0" >
    <commentid>102112</commentid>
    <comment_count>11</comment_count>
    <who name="João Marcos Costa">joaomarcos.costa</who>
    <bug_when>2025-06-02 15:11:20 +0000</bug_when>
    <thetext>https://autobuilder.yoctoproject.org/valkyrie/#/builders/73/builds/1550/steps/12/logs/stdio

qemux86-64-ptest ubuntu2204-vk-2</thetext>
  </long_desc><long_desc isprivate="0" >
    <commentid>102123</commentid>
    <comment_count>12</comment_count>
    <who name="João Marcos Costa">joaomarcos.costa</who>
    <bug_when>2025-06-03 09:10:42 +0000</bug_when>
    <thetext>https://autobuilder.yoctoproject.org/valkyrie/#/builders/73/builds/1563/steps/12/logs/stdio

qemux86-64-ptest rocky9-vk-3</thetext>
  </long_desc><long_desc isprivate="0" >
    <commentid>102210</commentid>
    <comment_count>13</comment_count>
    <who name="João Marcos Costa">joaomarcos.costa</who>
    <bug_when>2025-06-09 06:40:10 +0000</bug_when>
    <thetext>https://autobuilder.yoctoproject.org/valkyrie/#/builders/73/builds/1649/steps/13/logs/stdio

qemux86-64-ptest alma8-vk-2</thetext>
  </long_desc><long_desc isprivate="0" >
    <commentid>102338</commentid>
    <comment_count>14</comment_count>
    <who name="João Marcos Costa">joaomarcos.costa</who>
    <bug_when>2025-06-25 08:03:17 +0000</bug_when>
    <thetext>https://autobuilder.yoctoproject.org/valkyrie/#/builders/61/builds/1754/steps/12/logs/stdio

qemuarm64-ptest ubuntu2404-vk-arm2</thetext>
  </long_desc><long_desc isprivate="0" >
    <commentid>102518</commentid>
    <comment_count>15</comment_count>
    <who name="João Marcos Costa">joaomarcos.costa</who>
    <bug_when>2025-07-28 08:12:03 +0000</bug_when>
    <thetext>https://autobuilder.yoctoproject.org/valkyrie/#/builders/61/builds/1891/steps/12/logs/stdio

qemuarm64-ptest ubuntu2204-vk-arm2</thetext>
  </long_desc><long_desc isprivate="0" >
    <commentid>102626</commentid>
    <comment_count>16</comment_count>
    <who name="João Marcos Costa">joaomarcos.costa</who>
    <bug_when>2025-08-19 12:43:27 +0000</bug_when>
    <thetext>https://autobuilder.yoctoproject.org/valkyrie/#/builders/61/builds/2023/steps/12/logs/stdio

qemuarm64-ptest ubuntu2204-vk-arm1</thetext>
  </long_desc><long_desc isprivate="0" >
    <commentid>102640</commentid>
    <comment_count>17</comment_count>
    <who name="João Marcos Costa">joaomarcos.costa</who>
    <bug_when>2025-08-21 07:55:10 +0000</bug_when>
    <thetext>https://autobuilder.yoctoproject.org/valkyrie/#/builders/73/builds/2149/steps/12/logs/stdio

qemux86-64-ptest rocky9-vk-2</thetext>
  </long_desc><long_desc isprivate="0" >
    <commentid>102660</commentid>
    <comment_count>18</comment_count>
    <who name="João Marcos Costa">joaomarcos.costa</who>
    <bug_when>2025-08-22 08:09:53 +0000</bug_when>
    <thetext>https://autobuilder.yoctoproject.org/valkyrie/#/builders/73/builds/2150/steps/12/logs/stdio

qemux86-64-ptest fedora42-vk-1</thetext>
  </long_desc><long_desc isprivate="0" >
    <commentid>102704</commentid>
    <comment_count>19</comment_count>
    <who name="Ross Burton">ross.burton</who>
    <bug_when>2025-09-05 12:37:25 +0000</bug_when>
    <thetext>Filed upstream at https://core.tcl-lang.org/tcl/tktview/3764f4e81f1483ab554c6d60f8483887bde28221.</thetext>
  </long_desc><long_desc isprivate="0" >
    <commentid>102705</commentid>
    <comment_count>20</comment_count>
    <who name="Ross Burton">ross.burton</who>
    <bug_when>2025-09-05 12:43:24 +0000</bug_when>
    <thetext>And sent a skip for these tests.</thetext>
  </long_desc><long_desc isprivate="0" >
    <commentid>102749</commentid>
    <comment_count>21</comment_count>
    <who name="Randy MacLeod">randy.macleod</who>
    <bug_when>2025-09-11 15:09:23 +0000</bug_when>
    <thetext>Ross, fixed so please report the commit and close.</thetext>
  </long_desc><long_desc isprivate="0" >
    <commentid>102750</commentid>
    <comment_count>22</comment_count>
    <who name="Ross Burton">ross.burton</who>
    <bug_when>2025-09-11 15:09:47 +0000</bug_when>
    <thetext>Fixed in oe-core 8f1538518fd3a3017189b38437691ce358a2566a.</thetext>
  </long_desc>
      
      

    </bug>

</bugzilla>