<?xml version="1.0" encoding="UTF-8" standalone="yes" ?>
<!DOCTYPE bugzilla SYSTEM "https://bugzilla.yoctoproject.org/page.cgi?id=bugzilla.dtd">

<bugzilla version="5.0.6"
          urlbase="https://bugzilla.yoctoproject.org/"
          
          maintainer="it-coreprojects-helpdesk@linuxfoundation.org"
>

    <bug>
          <bug_id>15610</bug_id>
          
          <creation_ts>2024-10-04 16:26:02 +0000</creation_ts>
          <short_desc>AB-INT: groff: error: couldn&apos;t exec grn: No such file or directory</short_desc>
          <delta_ts>2024-10-16 16:02:05 +0000</delta_ts>
          <reporter_accessible>1</reporter_accessible>
          <cclist_accessible>1</cclist_accessible>
          <classification_id>10</classification_id>
          <classification>QA/Testing</classification>
          <product>Functional (self) Testing</product>
          <component>general</component>
          <version>unspecified</version>
          <rep_platform>x86</rep_platform>
          <op_sys>Multiple</op_sys>
          <bug_status>RESOLVED</bug_status>
          <resolution>FIXED</resolution>
          
          
          <bug_file_loc></bug_file_loc>
          <status_whiteboard>AB-INT</status_whiteboard>
          <keywords></keywords>
          <priority>Medium</priority>
          <bug_severity>normal</bug_severity>
          <target_milestone>5.2</target_milestone>
          
          
          <everconfirmed>1</everconfirmed>
          <reporter name="Mathieu Dubois-Briand">mathieu.dubois-briand</reporter>
          <assigned_to name="Unassigned">unassigned</assigned_to>
          <cc>ross.burton</cc>
    
    <cc>tim.orling</cc>
          
          
          <cf_os>---</cf_os>
          <cf_regression_type>---</cf_regression_type>
          
          <cf_docchange>No (bug/feature does not impact docs)</cf_docchange>

      

      

      

          <comment_sort_order>oldest_to_newest</comment_sort_order>  
          <long_desc isprivate="0" >
    <commentid>99777</commentid>
    <comment_count>0</comment_count>
    <who name="Mathieu Dubois-Briand">mathieu.dubois-briand</who>
    <bug_when>2024-10-04 16:26:02 +0000</bug_when>
    <thetext>Saw once on the autobuilder, during qemuarm64 test on stream8-ty-1.

| /home/pokybuild/yocto-worker/qemuarm64/build/build/tmp/work/x86_64-linux/groff-native/1.23.0/groff-1.23.0/groff: error: couldn&apos;t exec grn: No such file or directory
| /home/pokybuild/yocto-worker/qemuarm64/build/build/tmp/work/x86_64-linux/groff-native/1.23.0/groff-1.23.0/groff: error: couldn&apos;t exec grn: No such file or directory
| grops:&lt;standard input&gt;:(&lt;standard input&gt;):7: fatal error: &apos;V&apos; command invalid before first &apos;p&apos; command
| grops:&lt;standard input&gt;:(&lt;standard input&gt;):7: fatal error: &apos;V&apos; command invalid before first &apos;p&apos; command
| make[1]: *** [Makefile:13990: contrib/hdtbl/examples/chess_board.ps] Error 5
| make[1]: *** Deleting file &apos;contrib/hdtbl/examples/chess_board.ps&apos;
| make[1]: *** Waiting for unfinished jobs....
| make[1]: *** [Makefile:13990: contrib/hdtbl/examples/color_boxes.ps] Error 5
| make[1]: *** Deleting file &apos;contrib/hdtbl/examples/color_boxes.ps&apos;
| make[1]: Leaving directory &apos;/home/pokybuild/yocto-worker/qemuarm64/build/build/tmp/work/x86_64-linux/groff-native/1.23.0/groff-1.23.0&apos;
| make: *** [Makefile:6107: all] Error 2
| ERROR: oe_runmake failed

https://autobuilder.yoctoproject.org/typhoon/#/builders/42/builds/9249/steps/14/logs/stdio</thetext>
  </long_desc><long_desc isprivate="0" >
    <commentid>99834</commentid>
    <comment_count>1</comment_count>
    <who name="Ross Burton">ross.burton</who>
    <bug_when>2024-10-10 17:01:02 +0000</bug_when>
    <thetext>Notably, this failed three months ago and the commit that broke is part of styhead.</thetext>
  </long_desc><long_desc isprivate="0" >
    <commentid>99835</commentid>
    <comment_count>2</comment_count>
    <who name="Ross Burton">ross.burton</who>
    <bug_when>2024-10-10 17:12:07 +0000</bug_when>
    <thetext>Confirmed this is a Makefile race.</thetext>
  </long_desc><long_desc isprivate="0" >
    <commentid>99836</commentid>
    <comment_count>3</comment_count>
    <who name="Ross Burton">ross.burton</who>
    <bug_when>2024-10-10 17:36:17 +0000</bug_when>
    <thetext>https://savannah.gnu.org/bugs/?66316</thetext>
  </long_desc><long_desc isprivate="0" >
    <commentid>99858</commentid>
    <comment_count>4</comment_count>
    <who name="Ross Burton">ross.burton</who>
    <bug_when>2024-10-14 12:23:36 +0000</bug_when>
    <thetext>Patch on the list.</thetext>
  </long_desc><long_desc isprivate="0" >
    <commentid>99892</commentid>
    <comment_count>5</comment_count>
    <who name="Mathieu Dubois-Briand">mathieu.dubois-briand</who>
    <bug_when>2024-10-16 15:45:11 +0000</bug_when>
    <thetext>meta-intel debian12-vk-3
https://valkyrie.yoctoproject.org/#/builders/41/builds/229/steps/12/logs/stdio</thetext>
  </long_desc><long_desc isprivate="0" >
    <commentid>99896</commentid>
    <comment_count>6</comment_count>
    <who name="Ross Burton">ross.burton</who>
    <bug_when>2024-10-16 16:02:05 +0000</bug_when>
    <thetext>Merged in d590a32423d05cefc4e7282f971f633b3fa0b941.</thetext>
  </long_desc>
      
      

    </bug>

</bugzilla>