<?xml version="1.0" encoding="UTF-8" standalone="yes" ?>
<!DOCTYPE bugzilla SYSTEM "https://bugzilla.yoctoproject.org/page.cgi?id=bugzilla.dtd">

<bugzilla version="5.0.6"
          urlbase="https://bugzilla.yoctoproject.org/"
          
          maintainer="it-coreprojects-helpdesk@linuxfoundation.org"
>

    <bug>
          <bug_id>15659</bug_id>
          
          <creation_ts>2024-11-25 14:31:47 +0000</creation_ts>
          <short_desc>AB-INT: toaster test failures (2)</short_desc>
          <delta_ts>2026-09-17 14:54:29 +0000</delta_ts>
          <reporter_accessible>1</reporter_accessible>
          <cclist_accessible>1</cclist_accessible>
          <classification_id>10</classification_id>
          <classification>QA/Testing</classification>
          <product>Functional (self) Testing</product>
          <component>general</component>
          <version>unspecified</version>
          <rep_platform>x86</rep_platform>
          <op_sys>Multiple</op_sys>
          <bug_status>RESOLVED</bug_status>
          <resolution>OBSOLETE</resolution>
          
          
          <bug_file_loc></bug_file_loc>
          <status_whiteboard>AB-INT</status_whiteboard>
          <keywords></keywords>
          <priority>Medium</priority>
          <bug_severity>normal</bug_severity>
          <target_milestone>6.1</target_milestone>
          
          
          <everconfirmed>1</everconfirmed>
          <reporter name="Mathieu Dubois-Briand">mathieu.dubois-briand</reporter>
          <assigned_to name="Unassigned">unassigned</assigned_to>
          <cc>david.reyna</cc>
    
    <cc>randy.macleod</cc>
          
          
          <cf_os>---</cf_os>
          <cf_regression_type>---</cf_regression_type>
          
          <cf_docchange>No (bug/feature does not impact docs)</cf_docchange>

      

      

      

          <comment_sort_order>oldest_to_newest</comment_sort_order>  
          <long_desc isprivate="0" >
    <commentid>100260</commentid>
    <comment_count>0</comment_count>
    <who name="Mathieu Dubois-Briand">mathieu.dubois-briand</who>
    <bug_when>2024-11-25 14:31:47 +0000</bug_when>
    <thetext>Continuation of https://bugzilla.yoctoproject.org/show_bug.cgi?id=15460, new ticket as the error output should be better now.</thetext>
  </long_desc><long_desc isprivate="0" >
    <commentid>100263</commentid>
    <comment_count>1</comment_count>
    <who name="Mathieu Dubois-Briand">mathieu.dubois-briand</who>
    <bug_when>2024-11-25 14:46:38 +0000</bug_when>
    <thetext>toaster ubuntu2204-vk-4 master completed at 2024-11-23T03:22:32Z
https://valkyrie.yoctoproject.org/#/builders/88/builds/141/steps/11/logs/stdio</thetext>
  </long_desc><long_desc isprivate="0" >
    <commentid>100304</commentid>
    <comment_count>2</comment_count>
    <who name="Randy MacLeod">randy.macleod</who>
    <bug_when>2024-11-28 15:39:58 +0000</bug_when>
    <thetext>Medium for now.</thetext>
  </long_desc><long_desc isprivate="0" >
    <commentid>100322</commentid>
    <comment_count>3</comment_count>
    <who name="Randy MacLeod">randy.macleod</who>
    <bug_when>2024-11-29 15:05:54 +0000</bug_when>
    <thetext>There are many reasons that a a URL connection could fail with:

urllib3.exceptions.ReadTimeoutError: HTTPConnectionPool(host=&apos;localhost&apos;, port=39381): Read timed out. (read timeout=120)

with a timeout of 120 s, I suspect network issues but there is a bug in 
python3-idna which is used by urllib3 IIRC and it can cause extremely long
run-time:
https://nvd.nist.gov/vuln/detail/cve-2024-3651

Anyway, I just thought I&apos;d mention it in case the more likely causes can&apos;t explain this problem.</thetext>
  </long_desc><long_desc isprivate="0" >
    <commentid>100386</commentid>
    <comment_count>4</comment_count>
    <who name="Mathieu Dubois-Briand">mathieu.dubois-briand</who>
    <bug_when>2024-12-09 09:28:41 +0000</bug_when>
    <thetext>toaster ubuntu2404-vk-1 master completed at 2024-12-05T03:33:43Z
E               TimeoutError: timed out
https://valkyrie.yoctoproject.org/#/builders/88/builds/153/steps/11/logs/stdio</thetext>
  </long_desc><long_desc isprivate="0" >
    <commentid>100415</commentid>
    <comment_count>5</comment_count>
    <who name="Mathieu Dubois-Briand">mathieu.dubois-briand</who>
    <bug_when>2024-12-12 09:53:24 +0000</bug_when>
    <thetext>toaster ubuntu2404-vk-1 master completed at 2024-12-12T03:01:07Z
E               sqlite3.OperationalError: disk I/O error
E               django.db.utils.OperationalError: disk I/O error
https://valkyrie.yoctoproject.org/#/builders/88/builds/160/steps/11/logs/stdio</thetext>
  </long_desc><long_desc isprivate="0" >
    <commentid>100509</commentid>
    <comment_count>6</comment_count>
    <who name="Mathieu Dubois-Briand">mathieu.dubois-briand</who>
    <bug_when>2024-12-26 16:40:16 +0000</bug_when>
    <thetext>toaster ubuntu2410-vk-1 master completed at 2024-12-25T03:12:30Z
selenium.common.exceptions.TimeoutException: Message: An element matching &quot;#project-created-notification&quot; should be visible
https://valkyrie.yoctoproject.org/#/builders/88/builds/173/steps/11/logs/stdio</thetext>
  </long_desc><long_desc isprivate="0" >
    <commentid>100627</commentid>
    <comment_count>7</comment_count>
    <who name="Mathieu Dubois-Briand">mathieu.dubois-briand</who>
    <bug_when>2025-01-14 10:07:25 +0000</bug_when>
    <thetext>toaster ubuntu2410-vk-1 master completed at 2025-01-08T03:13:02Z
selenium.common.exceptions.ElementClickInterceptedException: Message: element click intercepted: Element &lt;input type=&quot;checkbox&quot; class=&quot;checkbox-mergeattr&quot; name=&quot;mergeattr&quot; value=&quot;mergeattr&quot;&gt; is not clickable at point (21, 468). Other element would receive the click: &lt;form method=&quot;POST&quot;&gt;...&lt;/form&gt;
https://valkyrie.yoctoproject.org/#/builders/88/builds/187/steps/11/logs/stdio

toaster ubuntu2410-vk-1 master completed at 2025-01-09T03:22:22Z
TimeoutError: timed out
https://valkyrie.yoctoproject.org/#/builders/88/builds/188/steps/11/logs/stdio

toaster ubuntu2410-vk-1 master completed at 2025-01-11T03:01:06Z
E               django.db.utils.OperationalError: disk I/O error
E               sqlite3.OperationalError: disk I/O error    
https://valkyrie.yoctoproject.org/#/builders/88/builds/190/steps/11/logs/stdio</thetext>
  </long_desc><long_desc isprivate="0" >
    <commentid>100693</commentid>
    <comment_count>8</comment_count>
    <who name="Mathieu Dubois-Briand">mathieu.dubois-briand</who>
    <bug_when>2025-01-20 08:39:02 +0000</bug_when>
    <thetext>toaster ubuntu2404-vk-2 master completed at 2025-01-16T03:12:38Z
E       selenium.common.exceptions.TimeoutException: Message: An element matching &quot;#project-created-notification&quot; should be visible
https://autobuilder.yoctoproject.org/valkyrie/#/builders/88/builds/195/steps/11/logs/stdio</thetext>
  </long_desc><long_desc isprivate="0" >
    <commentid>101224</commentid>
    <comment_count>9</comment_count>
    <who name="Mathieu Dubois-Briand">mathieu.dubois-briand</who>
    <bug_when>2025-02-25 12:47:30 +0000</bug_when>
    <thetext>toaster ubuntu2404-vk-1 master completed at 2025-02-25T03:12:12Z
https://autobuilder.yoctoproject.org/valkyrie/#/builders/88/builds/235/steps/11/logs/stdio</thetext>
  </long_desc><long_desc isprivate="0" >
    <commentid>101295</commentid>
    <comment_count>10</comment_count>
    <who name="Mathieu Dubois-Briand">mathieu.dubois-briand</who>
    <bug_when>2025-03-06 13:54:09 +0000</bug_when>
    <thetext>toaster ubuntu2204-vk-2 master completed at 2025-03-05T10:42:57Z
https://autobuilder.yoctoproject.org/valkyrie/#/builders/88/builds/244/steps/11/logs/stdio

toaster ubuntu2404-vk-2 master-next completed at 2025-03-05T11:45:19Z
https://autobuilder.yoctoproject.org/valkyrie/#/builders/88/builds/245/steps/11/logs/stdio</thetext>
  </long_desc><long_desc isprivate="0" >
    <commentid>101331</commentid>
    <comment_count>11</comment_count>
    <who name="Mathieu Dubois-Briand">mathieu.dubois-briand</who>
    <bug_when>2025-03-10 09:43:07 +0000</bug_when>
    <thetext>toaster ubuntu2410-vk-1 master completed at 2025-03-10T03:12:59Z
E       selenium.common.exceptions.TimeoutException: Message: An element matching &quot;#project-created-notification&quot; should be visible
https://autobuilder.yoctoproject.org/valkyrie/#/builders/88/builds/251/steps/11/logs/stdio</thetext>
  </long_desc><long_desc isprivate="0" >
    <commentid>101403</commentid>
    <comment_count>12</comment_count>
    <who name="Mathieu Dubois-Briand">mathieu.dubois-briand</who>
    <bug_when>2025-03-18 09:53:09 +0000</bug_when>
    <thetext>toaster ubuntu2404-vk-1 master completed at 2025-03-18T03:13:39Z
E       selenium.common.exceptions.TimeoutException: Message: An element matching &quot;#project-created-notification&quot; should be visible
https://autobuilder.yoctoproject.org/valkyrie/#/builders/88/builds/259/steps/11/logs/stdio</thetext>
  </long_desc><long_desc isprivate="0" >
    <commentid>101546</commentid>
    <comment_count>13</comment_count>
    <who name="Mathieu Dubois-Briand">mathieu.dubois-briand</who>
    <bug_when>2025-04-02 13:51:53 +0000</bug_when>
    <thetext>toaster ubuntu2204-vk-4 master completed at 2025-03-30T03:26:29Z
E               TimeoutError: timed out
https://autobuilder.yoctoproject.org/valkyrie/#/builders/88/builds/271/steps/11/logs/stdio</thetext>
  </long_desc><long_desc isprivate="0" >
    <commentid>101829</commentid>
    <comment_count>14</comment_count>
    <who name="Randy MacLeod">randy.macleod</who>
    <bug_when>2025-05-01 14:07:09 +0000</bug_when>
    <thetext>Bulk move of all unassigned 5.2 medium importance bugs to 5.3.</thetext>
  </long_desc><long_desc isprivate="0" >
    <commentid>101864</commentid>
    <comment_count>15</comment_count>
    <who name="Mathieu Dubois-Briand">mathieu.dubois-briand</who>
    <bug_when>2025-05-02 09:51:54 +0000</bug_when>
    <thetext>toaster ubuntu2204-vk-4 master completed at 2025-05-01T03:13:54Z
E       selenium.common.exceptions.TimeoutException: Message: An element matching &quot;#project-created-notification&quot; should be visible
https://autobuilder.yoctoproject.org/valkyrie/#/builders/88/builds/303/steps/11/logs/stdio</thetext>
  </long_desc><long_desc isprivate="0" >
    <commentid>101946</commentid>
    <comment_count>16</comment_count>
    <who name="Mathieu Dubois-Briand">mathieu.dubois-briand</who>
    <bug_when>2025-05-12 13:41:39 +0000</bug_when>
    <thetext>toaster ubuntu2204-vk-2 master completed at 2025-05-12T03:28:49Z
TimeoutError: timed out
https://autobuilder.yoctoproject.org/valkyrie/#/builders/88/builds/314/steps/11/logs/stdio</thetext>
  </long_desc><long_desc isprivate="0" >
    <commentid>102084</commentid>
    <comment_count>17</comment_count>
    <who name="Mathieu Dubois-Briand">mathieu.dubois-briand</who>
    <bug_when>2025-05-28 07:21:42 +0000</bug_when>
    <thetext>toaster ubuntu2404-vk-3 master completed at 2025-05-28T03:12:33Z
E       selenium.common.exceptions.ElementClickInterceptedException: Message: element click intercepted: Element &lt;a href=&quot;#&quot; class=&quot;btn btn-primary btn-lg&quot; id=&quot;save-changes-for-switch&quot;&gt;...&lt;/a&gt; is not clickable at point (89, 22). Other element would receive the click: &lt;img class=&quot;logo&quot; src=&quot;/static/img/logo.png&quot; alt=&quot;Yocto logo project&quot;&gt;
https://autobuilder.yoctoproject.org/valkyrie/#/builders/88/builds/332/steps/11/logs/stdio</thetext>
  </long_desc><long_desc isprivate="0" >
    <commentid>102665</commentid>
    <comment_count>18</comment_count>
    <who name="Mathieu Dubois-Briand">mathieu.dubois-briand</who>
    <bug_when>2025-08-26 08:54:16 +0000</bug_when>
    <thetext>toaster ubuntu2404-vk-2 master completed at 2025-08-26 03:14:02+00:00
E       selenium.common.exceptions.ElementClickInterceptedException: Message: element click intercepted: Element &lt;input type=&quot;checkbox&quot; class=&quot;checkbox-mergeattr&quot; name=&quot;mergeattr&quot; value=&quot;mergeattr&quot;&gt; is not clickable at point (21, 468). Other element would receive the click: &lt;form method=&quot;POST&quot;&gt;...&lt;/form&gt;
https://autobuilder.yoctoproject.org/valkyrie/#/builders/88/builds/429/steps/11/logs/stdio</thetext>
  </long_desc><long_desc isprivate="0" >
    <commentid>102810</commentid>
    <comment_count>19</comment_count>
    <who name="Mathieu Dubois-Briand">mathieu.dubois-briand</who>
    <bug_when>2025-09-25 08:03:15 +0000</bug_when>
    <thetext>Lots of errors, it might be something else...

toaster ubuntu2204-vk-2 master completed at 2025-09-25 03:30:07+00:00
E               TimeoutError: timed out
https://autobuilder.yoctoproject.org/valkyrie/#/builders/88/builds/459/steps/11/logs/stdio</thetext>
  </long_desc><long_desc isprivate="0" >
    <commentid>103329</commentid>
    <comment_count>20</comment_count>
    <who name="Mathieu Dubois-Briand">mathieu.dubois-briand</who>
    <bug_when>2025-11-19 16:08:24 +0000</bug_when>
    <thetext>toaster ubuntu2404-vk-1 master completed at 2025-11-19 03:12:49+00:00
E           selenium.common.exceptions.NoSuchElementException: Message: Cannot locate option with value: 7; For documentation on this error, please visit: https://www.selenium.dev/documentation/webdriver/troubleshooting/errors#nosuchelementexception
https://autobuilder.yoctoproject.org/valkyrie/#/builders/88/builds/517/steps/12/logs/stdio</thetext>
  </long_desc><long_desc isprivate="0" >
    <commentid>103432</commentid>
    <comment_count>21</comment_count>
    <who name="Mathieu Dubois-Briand">mathieu.dubois-briand</who>
    <bug_when>2025-11-28 08:06:09 +0000</bug_when>
    <thetext>toaster ubuntu2404-vk-1 master completed at 2025-11-28 03:12:53+00:00
E       selenium.common.exceptions.ElementClickInterceptedException: Message: element click intercepted: Element &lt;input type=&quot;checkbox&quot; class=&quot;checkbox-mergeattr&quot; name=&quot;mergeattr&quot; value=&quot;mergeattr&quot;&gt; is not clickable at point (21, 468). Other element would receive the click: &lt;form method=&quot;POST&quot;&gt;...&lt;/form&gt;
https://autobuilder.yoctoproject.org/valkyrie/#/builders/88/builds/528/steps/12/logs/stdio</thetext>
  </long_desc><long_desc isprivate="0" >
    <commentid>104211</commentid>
    <comment_count>22</comment_count>
    <who name="Mathieu Dubois-Briand">mathieu.dubois-briand</who>
    <bug_when>2026-02-10 10:19:51 +0000</bug_when>
    <thetext>toaster ubuntu2404-vk-3 master completed at 2026-02-10 03:14:42+00:00
E       selenium.common.exceptions.TimeoutException: Message: A matching element never became be clickable
https://autobuilder.yoctoproject.org/valkyrie/#/builders/88/builds/606/steps/12/logs/stdio</thetext>
  </long_desc><long_desc isprivate="0" >
    <commentid>104846</commentid>
    <comment_count>23</comment_count>
    <who name="Mathieu Dubois-Briand">mathieu.dubois-briand</who>
    <bug_when>2026-03-27 09:53:50 +0000</bug_when>
    <thetext>toaster ubuntu2404-vk-1 master completed at 2026-03-27 03:06:28+00:00
E           RuntimeError: Can&apos;t initialize toaster. Port 8000 occupied by python3 /srv/pokybuild/yocto-worker/toaster/build/layers/bitbake/bin/../lib/toaster/manage.py runserver --noreload localhost:8000
Maybe two instances of toaster tests running in parallel?
https://autobuilder.yoctoproject.org/valkyrie/#/builders/88/builds/654/steps/12/logs/stdio</thetext>
  </long_desc><long_desc isprivate="0" >
    <commentid>104869</commentid>
    <comment_count>24</comment_count>
    <who name="Mathieu Dubois-Briand">mathieu.dubois-briand</who>
    <bug_when>2026-03-31 09:03:25 +0000</bug_when>
    <thetext>toaster ubuntu2404-vk-3 master completed at 2026-03-31 03:12:49+00:00
E       selenium.common.exceptions.ElementClickInterceptedException: Message: element click intercepted: Element &lt;input type=&quot;checkbox&quot; class=&quot;checkbox-mergeattr&quot; name=&quot;mergeattr&quot; value=&quot;mergeattr&quot;&gt; is not clickable at point (21, 468). Other element would receive the click: &lt;form method=&quot;POST&quot;&gt;...&lt;/form&gt;
https://autobuilder.yoctoproject.org/valkyrie/#/builders/88/builds/658/steps/12/logs/stdio</thetext>
  </long_desc><long_desc isprivate="0" >
    <commentid>105005</commentid>
    <comment_count>25</comment_count>
    <who name="Mathieu Dubois-Briand">mathieu.dubois-briand</who>
    <bug_when>2026-04-09 08:51:41 +0000</bug_when>
    <thetext>toaster ubuntu2204-vk-3 master completed at 2026-04-09 03:14:28+00:00
E       selenium.common.exceptions.WebDriverException: Message: tab crashed
https://autobuilder.yoctoproject.org/valkyrie/#/builders/88/builds/667/steps/12/logs/stdio</thetext>
  </long_desc><long_desc isprivate="0" >
    <commentid>105069</commentid>
    <comment_count>26</comment_count>
    <who name="Mathieu Dubois-Briand">mathieu.dubois-briand</who>
    <bug_when>2026-04-14 12:07:41 +0000</bug_when>
    <thetext>toaster ubuntu2204-vk-2 master completed at 2026-04-14 03:22:53+00:00
E               TimeoutError: timed out
https://autobuilder.yoctoproject.org/valkyrie/#/builders/88/builds/672/steps/12/logs/stdio</thetext>
  </long_desc><long_desc isprivate="0" >
    <commentid>105599</commentid>
    <comment_count>27</comment_count>
    <who name="Randy MacLeod">randy.macleod</who>
    <bug_when>2026-05-28 13:16:28 +0000</bug_when>
    <thetext>Bulk move of 6.0 Medium bugs to 6.1.</thetext>
  </long_desc><long_desc isprivate="0" >
    <commentid>106162</commentid>
    <comment_count>28</comment_count>
    <who name="Mathieu Dubois-Briand">mathieu.dubois-briand</who>
    <bug_when>2026-07-13 08:11:10 +0000</bug_when>
    <thetext>toaster ubuntu2404-vk-1 master completed at 2026-07-12 03:33:38+00:00
E               TimeoutError: timed out
E           RuntimeError: Can&apos;t initialize toaster. Port 8000 occupied by python3 /srv/pokybuild/yocto-worker/toaster/build/layers/bitbake/bin/../lib/toas
https://autobuilder.yoctoproject.org/valkyrie/#/builders/88/builds/764/steps/12/logs/stdio</thetext>
  </long_desc><long_desc isprivate="0" >
    <commentid>106180</commentid>
    <comment_count>29</comment_count>
    <who name="Mathieu Dubois-Briand">mathieu.dubois-briand</who>
    <bug_when>2026-07-16 07:30:14 +0000</bug_when>
    <thetext>toaster ubuntu2204-vk-2 master completed at 2026-07-16 03:12:47+00:00
E       selenium.common.exceptions.StaleElementReferenceException: Message: stale element reference: stale element not found in the current frame
https://autobuilder.yoctoproject.org/valkyrie/#/builders/88/builds/768/steps/12/logs/stdio</thetext>
  </long_desc><long_desc isprivate="0" >
    <commentid>106286</commentid>
    <comment_count>30</comment_count>
    <who name="Mathieu Dubois-Briand">mathieu.dubois-briand</who>
    <bug_when>2026-07-23 08:59:44 +0000</bug_when>
    <thetext>toaster ubuntu2204-vk-1 master completed at 2026-07-23 03:12:46+00:00
E       selenium.common.exceptions.StaleElementReferenceException: Message: stale element reference: stale element not found in the current frame
https://autobuilder.yoctoproject.org/valkyrie/#/builders/88/builds/775/steps/12/logs/stdio</thetext>
  </long_desc><long_desc isprivate="0" >
    <commentid>106428</commentid>
    <comment_count>31</comment_count>
    <who name="Mathieu Dubois-Briand">mathieu.dubois-briand</who>
    <bug_when>2026-08-04 07:15:40 +0000</bug_when>
    <thetext>toaster ubuntu2510-vk-1 master completed at 2026-08-04 03:11:43+00:00
&gt;       self.assertTrue(len(rows) == 1)
E       AssertionError: False is not true
https://autobuilder.yoctoproject.org/valkyrie/#/builders/88/builds/787/steps/14/logs/stdio</thetext>
  </long_desc><long_desc isprivate="0" >
    <commentid>106434</commentid>
    <comment_count>32</comment_count>
    <who name="Mathieu Dubois-Briand">mathieu.dubois-briand</who>
    <bug_when>2026-08-05 12:51:54 +0000</bug_when>
    <thetext>toaster ubuntu2510-vk-1 master completed at 2026-08-05 03:11:43+00:00
E       selenium.common.exceptions.StaleElementReferenceException: Message: stale element reference: stale element not found in the current frame
https://autobuilder.yoctoproject.org/valkyrie/#/builders/88/builds/788/steps/14/logs/stdio</thetext>
  </long_desc><long_desc isprivate="0" >
    <commentid>106542</commentid>
    <comment_count>33</comment_count>
    <who name="Mathieu Dubois-Briand">mathieu.dubois-briand</who>
    <bug_when>2026-08-17 08:29:29 +0000</bug_when>
    <thetext>toaster ubuntu2204-vk-1 master completed at 2026-08-15 03:12:59+00:00
E       selenium.common.exceptions.TimeoutException: Message: An element matching &quot;#change-notification&quot; should be visible
https://autobuilder.yoctoproject.org/valkyrie/#/builders/88/builds/798/steps/14/logs/stdio</thetext>
  </long_desc><long_desc isprivate="0" >
    <commentid>106549</commentid>
    <comment_count>34</comment_count>
    <who name="Mathieu Dubois-Briand">mathieu.dubois-briand</who>
    <bug_when>2026-08-18 07:39:10 +0000</bug_when>
    <thetext>toaster ubuntu2404-vk-3 master completed at 2026-08-18 03:09:50+00:00
E       urllib.error.HTTPError: HTTP Error 403: Forbidden
E               layerindexlib.LayerIndexFetchError: Unable to fetch layerindex url https://layers.openembedded.org/layerindex/api/: HTTP Error 403: Forbidden
E           layerindexlib.LayerIndexFetchError: Unable to fetch layerindex url https://layers.openembedded.org/layerindex/api/;branch=wrynose,HEAD,master,scarthgap: Unable to fetch layerindex url https://layers.openembedded.org/layerindex/api/: HTTP Error 403: Forbidden
E       selenium.common.exceptions.TimeoutException: Message: An element matching &quot;#distrostable&quot; should be visible
E       selenium.common.exceptions.TimeoutException: Message: An element matching &quot;#layerstable tbody tr&quot; should be visible
E       selenium.common.exceptions.TimeoutException: Message: An element matching &quot;#machinestable&quot; should be visible
E       selenium.common.exceptions.TimeoutException: Message: An element matching &quot;#softwarerecipestable&quot; should be visible
E       selenium.common.exceptions.TimeoutException: Message: An element matching &quot;#imagerecipestable tbody tr&quot; should be on the page
E       selenium.common.exceptions.TimeoutException: Message: An element matching &quot;#layer-container &gt; form &gt; div &gt; span &gt; div&quot; should be visible
E       selenium.common.exceptions.TimeoutException: Message: An element matching &quot;#imagerecipestable&quot; should be visible
https://autobuilder.yoctoproject.org/valkyrie/#/builders/88/builds/801/steps/14/logs/stdio</thetext>
  </long_desc><long_desc isprivate="0" >
    <commentid>106647</commentid>
    <comment_count>35</comment_count>
    <who name="Mathieu Dubois-Briand">mathieu.dubois-briand</who>
    <bug_when>2026-08-26 08:24:13 +0000</bug_when>
    <thetext>toaster ubuntu2204-vk-1 master completed at 2026-08-26 03:10:04+00:00
E           KeyError: 2073009
E       selenium.common.exceptions.TimeoutException: Message: An element matching &quot;#machinestable&quot; should be visible
E       selenium.common.exceptions.TimeoutException: Message: An element matching &quot;#softwarerecipestable&quot; should be visible
E       selenium.common.exceptions.TimeoutException: Message: An element matching &quot;#imagerecipestable tbody tr&quot; should be on the page
E       selenium.common.exceptions.TimeoutException: Message: An element matching &quot;#imagerecipestable&quot; should be visible
https://autobuilder.yoctoproject.org/valkyrie/#/builders/88/builds/809/steps/14/logs/stdio</thetext>
  </long_desc><long_desc isprivate="0" >
    <commentid>106869</commentid>
    <comment_count>36</comment_count>
    <who name="Randy MacLeod">randy.macleod</who>
    <bug_when>2026-09-17 14:54:29 +0000</bug_when>
    <thetext>There have been some toaster improvements we want to open new defects if there are additional problems.</thetext>
  </long_desc>
      
      

    </bug>

</bugzilla>