<?xml version="1.0" encoding="UTF-8" standalone="yes" ?>
<!DOCTYPE bugzilla SYSTEM "https://bugzilla.yoctoproject.org/page.cgi?id=bugzilla.dtd">

<bugzilla version="5.0.6"
          urlbase="https://bugzilla.yoctoproject.org/"
          
          maintainer="it-coreprojects-helpdesk@linuxfoundation.org"
>

    <bug>
          <bug_id>15782</bug_id>
          
          <creation_ts>2025-03-05 08:35:34 +0000</creation_ts>
          <short_desc>AB-INT: test_sstate_nativesdk_samesigs_multilib: AssertionError</short_desc>
          <delta_ts>2026-03-04 22:59:36 +0000</delta_ts>
          <reporter_accessible>1</reporter_accessible>
          <cclist_accessible>1</cclist_accessible>
          <classification_id>10</classification_id>
          <classification>QA/Testing</classification>
          <product>Functional (self) Testing</product>
          <component>oe-selftest</component>
          <version>unspecified</version>
          <rep_platform>x86</rep_platform>
          <op_sys>Multiple</op_sys>
          <bug_status>RESOLVED</bug_status>
          <resolution>WORKSFORME</resolution>
          
          
          <bug_file_loc></bug_file_loc>
          <status_whiteboard>AB-INT</status_whiteboard>
          <keywords></keywords>
          <priority>Medium</priority>
          <bug_severity>normal</bug_severity>
          <target_milestone>5.3</target_milestone>
          
          
          <everconfirmed>1</everconfirmed>
          <reporter name="Mathieu Dubois-Briand">mathieu.dubois-briand</reporter>
          <assigned_to name="Unassigned">unassigned</assigned_to>
          <cc>randy.macleod</cc>
          
          
          <cf_os>---</cf_os>
          <cf_regression_type>---</cf_regression_type>
          
          <cf_docchange>Don&apos;t know</cf_docchange>

      

      

      

          <comment_sort_order>oldest_to_newest</comment_sort_order>  
          <long_desc isprivate="0" >
    <commentid>101283</commentid>
    <comment_count>0</comment_count>
    <who name="Mathieu Dubois-Briand">mathieu.dubois-briand</who>
    <bug_when>2025-03-05 08:35:34 +0000</bug_when>
    <thetext>We only had this one once. I waited a bit to see if it occurred again, but not so far. I&apos;m opening a ticket to track it.

   1783 2025-02-26 00:18:37,901 - oe-selftest - INFO - 3: 23/25 467/616 (410.30s) (0 failed) (sstatetests.SStateHashSameSigs2.test_sstate_nativesdk_samesigs_multilib)
   1784 2025-02-26 00:18:37,901 - oe-selftest - INFO - testtools.testresult.real._StringException: Traceback (most recent call last):
   1785   File &quot;/srv/pokybuild/yocto-worker/oe-selftest-centos/build/meta/lib/oeqa/selftest/cases/sstatetests.py&quot;, line 504, in test_sstate_nativesdk_samesigs_multilib
   1786     self.sstate_common_samesigs(configA, configB)
   1787   File &quot;/srv/pokybuild/yocto-worker/oe-selftest-centos/build/meta/lib/oeqa/selftest/cases/sstatetests.py&quot;, line 213, in sstate_common_samesigs
   1788     self.assertEqual(files1, files2)
   1789   File &quot;/usr/lib64/python3.9/unittest/case.py&quot;, line 837, in assertEqual
   1790     assertion_func(first, second, msg=msg)
   1791   File &quot;/usr/lib64/python3.9/unittest/case.py&quot;, line 1136, in assertDictEqual
   1792     self.fail(self._formatMessage(msg, standardMsg))
   1793   File &quot;/usr/lib64/python3.9/unittest/case.py&quot;, line 676, in fail
   1794     raise self.failureException(msg)
   1795 AssertionError: {&apos;nat[950 chars]y/do_prepare_recipe_sysroot&apos;: &apos;b004650da4588a2[200464 chars]3ac&apos;} != {&apos;nat[950 chars]y/do_compile&apos;: &apos;1ebb8f83595643ed24f033294c0013[214086 chars]3ac&apos;}
   1796   {&apos;nativesdk-acl/do_collect_spdx_deps&apos;: &apos;52ce4dcf6b4663eca1cd13ed6cb69e229bbe525a637563cc2192645493c9a2f9&apos;,
   1797    &apos;nativesdk-acl/do_compile&apos;: &apos;8fa48d34dbb26027e46326fd440679e79485a8c65b668b25ed36235dc8c20f8f&apos;,
   1798    &apos;nativesdk-acl/do_configure&apos;: &apos;e192cb3340360e728cb4fb454f60c076d85d87c72f7f696b14521d04b3c35a77&apos;,
   1799    &apos;nativesdk-acl/do_create_package_spdx&apos;: &apos;d6c3a72f6a855dbdcba0fe1af74f31ef1dc3a372624decd642fbc1ae39d5e8da&apos;,
   1800    &apos;nativesdk-acl/do_create_spdx&apos;: &apos;fba11d313e0ed1ec1bd66d5ed892a22858d6f4a64c6ba8d40596d56c6ab12bb5&apos;,
   1801 +  &apos;nativesdk-acl/do_deploy_source_date_epoch&apos;: &apos;5181d9178d2fed6b50e794c1290d6d8aaa9c445d4729b30e9097ffe782a3a081&apos;,
   1802    &apos;nativesdk-acl/do_fetch&apos;: &apos;00a4f203a882f6aa7d906bee6d7fbdd9a0854b5187a170eb0b0c78c185d8e4b5&apos;,
   1803    &apos;nativesdk-acl/do_install&apos;: &apos;f756c9f5831876e9553d39b17efa3a205b36cbec7afe0bb4405380b408052c44&apos;,
   1804    &apos;nativesdk-acl/do_package&apos;: &apos;cb4a3fdde37a2aa449b0433e89c156ecfdc5ef60e48fbfb2b61fea570781d5bc&apos;,
   1805    &apos;nativesdk-acl/do_package_qa&apos;: &apos;44f9d4120f0bcea5996546d4d455c49367f04924cb3ba070dc0a162eca4c4499&apos;,
   1806    &apos;nativesdk-acl/do_package_write_rpm&apos;: &apos;189a7167cdcc97640b98d403ea64e4d3c59b6ebbe8f5514025bb9658e2b42943&apos;,
...</thetext>
  </long_desc><long_desc isprivate="0" >
    <commentid>101284</commentid>
    <comment_count>1</comment_count>
    <who name="Mathieu Dubois-Briand">mathieu.dubois-briand</who>
    <bug_when>2025-03-05 08:37:05 +0000</bug_when>
    <thetext>oe-selftest-centos rocky9-vk-3 master-next completed at 2025-02-26T01:14:10Z
https://autobuilder.yoctoproject.org/valkyrie/#/builders/76/builds/1035/steps/14/logs/stdio</thetext>
  </long_desc><long_desc isprivate="0" >
    <commentid>101330</commentid>
    <comment_count>2</comment_count>
    <who name="Mathieu Dubois-Briand">mathieu.dubois-briand</who>
    <bug_when>2025-03-10 09:43:05 +0000</bug_when>
    <thetext>oe-selftest-armhost ubuntu2404-vk-arm1 master-next completed at 2025-03-07T19:54:07Z
https://autobuilder.yoctoproject.org/valkyrie/#/builders/23/builds/1189/steps/14/logs/stdio

oe-selftest-fedora fedora41-vk-1 master-next completed at 2025-03-07T18:34:01Z
https://autobuilder.yoctoproject.org/valkyrie/#/builders/48/builds/1057/steps/14/logs/stdio

oe-selftest-centos rocky8-vk-1 master-next completed at 2025-03-07T19:11:52Z
https://autobuilder.yoctoproject.org/valkyrie/#/builders/76/builds/1097/steps/15/logs/stdio

oe-selftest-ubuntu ubuntu2410-vk-1 master-next completed at 2025-03-07T18:37:38Z
https://autobuilder.yoctoproject.org/valkyrie/#/builders/54/builds/1143/steps/14/logs/stdio

oe-selftest-debian debian12-vk-8 master-next completed at 2025-03-07T18:38:46Z
https://autobuilder.yoctoproject.org/valkyrie/#/builders/35/builds/1108/steps/14/logs/stdio</thetext>
  </long_desc><long_desc isprivate="0" >
    <commentid>101340</commentid>
    <comment_count>3</comment_count>
    <who name="Mathieu Dubois-Briand">mathieu.dubois-briand</who>
    <bug_when>2025-03-11 10:46:51 +0000</bug_when>
    <thetext>(In reply to Mathieu Dubois-Briand from comment #2)
&gt; oe-selftest-armhost ubuntu2404-vk-arm1 master-next completed at
&gt; 2025-03-07T19:54:07Z
&gt; https://autobuilder.yoctoproject.org/valkyrie/#/builders/23/builds/1189/
&gt; steps/14/logs/stdio
&gt; 
&gt; oe-selftest-fedora fedora41-vk-1 master-next completed at
&gt; 2025-03-07T18:34:01Z
&gt; https://autobuilder.yoctoproject.org/valkyrie/#/builders/48/builds/1057/
&gt; steps/14/logs/stdio
&gt; 
&gt; oe-selftest-centos rocky8-vk-1 master-next completed at 2025-03-07T19:11:52Z
&gt; https://autobuilder.yoctoproject.org/valkyrie/#/builders/76/builds/1097/
&gt; steps/15/logs/stdio
&gt; 
&gt; oe-selftest-ubuntu ubuntu2410-vk-1 master-next completed at
&gt; 2025-03-07T18:37:38Z
&gt; https://autobuilder.yoctoproject.org/valkyrie/#/builders/54/builds/1143/
&gt; steps/14/logs/stdio
&gt; 
&gt; oe-selftest-debian debian12-vk-8 master-next completed at
&gt; 2025-03-07T18:38:46Z
&gt; https://autobuilder.yoctoproject.org/valkyrie/#/builders/35/builds/1108/
&gt; steps/14/logs/stdio

Forget all logs from my last message, these were related to a patch in master-next.</thetext>
  </long_desc><long_desc isprivate="0" >
    <commentid>104498</commentid>
    <comment_count>4</comment_count>
    <who name="Randy MacLeod">randy.macleod</who>
    <bug_when>2026-03-04 22:59:36 +0000</bug_when>
    <thetext>Hasn&apos;t happened in almost a year. Re-open if seen again.</thetext>
  </long_desc>
      
      

    </bug>

</bugzilla>