<?xml version="1.0" encoding="UTF-8" standalone="yes" ?>
<!DOCTYPE bugzilla SYSTEM "https://bugzilla.yoctoproject.org/page.cgi?id=bugzilla.dtd">

<bugzilla version="5.0.6"
          urlbase="https://bugzilla.yoctoproject.org/"
          
          maintainer="it-coreprojects-helpdesk@linuxfoundation.org"
>

    <bug>
          <bug_id>15838</bug_id>
          
          <creation_ts>2025-04-23 08:47:07 +0000</creation_ts>
          <short_desc>AB-INT: wic.Wic.test_exclude_path_with_extra_space fails on debian workers</short_desc>
          <delta_ts>2025-05-01 14:54:13 +0000</delta_ts>
          <reporter_accessible>1</reporter_accessible>
          <cclist_accessible>1</cclist_accessible>
          <classification_id>10</classification_id>
          <classification>QA/Testing</classification>
          <product>Functional (self) Testing</product>
          <component>oe-selftest</component>
          <version>unspecified</version>
          <rep_platform>x86</rep_platform>
          <op_sys>Multiple</op_sys>
          <bug_status>RESOLVED</bug_status>
          <resolution>FIXED</resolution>
          
          
          <bug_file_loc></bug_file_loc>
          <status_whiteboard>AB-INT</status_whiteboard>
          <keywords></keywords>
          <priority>High</priority>
          <bug_severity>normal</bug_severity>
          <target_milestone>5.3 M1</target_milestone>
          
          
          <everconfirmed>1</everconfirmed>
          <reporter name="Mathieu Dubois-Briand">mathieu.dubois-briand</reporter>
          <assigned_to name="Trevor Woerner">twoerner</assigned_to>
          <cc>randy.macleod</cc>
          
          
          <cf_os>---</cf_os>
          <cf_regression_type>---</cf_regression_type>
          
          <cf_docchange>No (bug/feature does not impact docs)</cf_docchange>

      

      

      

          <comment_sort_order>oldest_to_newest</comment_sort_order>  
          <long_desc isprivate="0" >
    <commentid>101710</commentid>
    <comment_count>0</comment_count>
    <who name="Mathieu Dubois-Briand">mathieu.dubois-briand</who>
    <bug_when>2025-04-23 08:47:07 +0000</bug_when>
    <thetext>Not so intermittent, 100% reproducible on debian workers, as parted is missing.

2025-04-20 12:40:15,938 - oe-selftest - INFO - wic.Wic.test_exclude_path_with_extra_space (subunit.RemotedTestCase)
2025-04-20 12:40:15,939 - oe-selftest - INFO -  ... FAIL
...
2025-04-20 12:40:15,939 - oe-selftest - INFO - 5: 41/64 384/624 (64.94s) (0 failed) (wic.Wic.test_exclude_path_with_extra_space)
2025-04-20 12:40:15,939 - oe-selftest - INFO - testtools.testresult.real._StringException: Traceback (most recent call last):
  File &quot;/srv/pokybuild/yocto-worker/oe-selftest-debian/build/meta/lib/oeqa/selftest/cases/wic.py&quot;, line 568, in test_exclude_path_with_extra_space
    size_of_root_partition = int(runCmd(&quot;wic ls %s&quot; % wicout).output.split(&apos;\n&apos;)[2].split()[3])
  File &quot;/srv/pokybuild/yocto-worker/oe-selftest-debian/build/meta/lib/oeqa/utils/commands.py&quot;, line 214, in runCmd
    raise AssertionError(&quot;Command &apos;%s&apos; returned non-zero exit status %d:\n%s&quot; % (command, result.status, exc_output))
AssertionError: Command &apos;wic ls /srv/pokybuild/yocto-worker/oe-selftest-debian/build/build-st-3846829/tmp/deploy/images/qemux86-64/core-image-minimal-qemux86-64.rootfs-20250420123932.wic&apos; returned non-zero exit status 1:
ERROR: Can&apos;t find executable parted</thetext>
  </long_desc><long_desc isprivate="0" >
    <commentid>101712</commentid>
    <comment_count>1</comment_count>
    <who name="Mathieu Dubois-Briand">mathieu.dubois-briand</who>
    <bug_when>2025-04-23 08:58:22 +0000</bug_when>
    <thetext>oe-selftest-debian debian11-vk-1 mathieu/master-next completed at 2025-04-20T14:41:42Z
https://autobuilder.yoctoproject.org/valkyrie/#/builders/35/builds/1385/steps/14/logs/stdio

oe-selftest-debian debian12-vk-9 mathieu/master-next completed at 2025-04-21T15:59:41Z
https://autobuilder.yoctoproject.org/valkyrie/#/builders/35/builds/1389/steps/14/logs/stdio
oe-selftest-debian debian12-vk-8 master-next completed at 2025-04-18T23:40:24Z
https://autobuilder.yoctoproject.org/valkyrie/#/builders/35/builds/1381/steps/14/logs/stdio

oe-selftest-debian debian11-vk-3 mathieu/master-next completed at 2025-04-22T11:36:44Z
https://autobuilder.yoctoproject.org/valkyrie/#/builders/35/builds/1395/steps/14/logs/stdio
oe-selftest-debian debian11-vk-1 master completed at 2025-04-22T03:18:01Z
https://autobuilder.yoctoproject.org/valkyrie/#/builders/35/builds/1393/steps/14/logs/stdio

oe-selftest-debian debian12-vk-1 mathieu/master-next completed at 2025-04-23T06:24:15Z
https://autobuilder.yoctoproject.org/valkyrie/#/builders/35/builds/1402/steps/14/logs/stdio</thetext>
  </long_desc><long_desc isprivate="0" >
    <commentid>101723</commentid>
    <comment_count>2</comment_count>
    <who name="Mathieu Dubois-Briand">mathieu.dubois-briand</who>
    <bug_when>2025-04-24 14:14:03 +0000</bug_when>
    <thetext>oe-selftest-debian debian11-vk-2 master completed at 2025-04-24T02:47:13Z
https://autobuilder.yoctoproject.org/valkyrie/#/builders/35/builds/1410/steps/14/logs/stdio

oe-selftest-debian debian11-vk-2 mathieu/master-next completed at 2025-04-24T11:56:44Z
https://autobuilder.yoctoproject.org/valkyrie/#/builders/35/builds/1412/steps/14/logs/stdio</thetext>
  </long_desc><long_desc isprivate="0" >
    <commentid>101727</commentid>
    <comment_count>3</comment_count>
    <who name="Randy MacLeod">randy.macleod</who>
    <bug_when>2025-04-24 14:35:37 +0000</bug_when>
    <thetext>Richard has replied on the mail list with a fix suggestion that does not involve installing anything on the debian workers.</thetext>
  </long_desc><long_desc isprivate="0" >
    <commentid>101732</commentid>
    <comment_count>4</comment_count>
    <who name="Randy MacLeod">randy.macleod</who>
    <bug_when>2025-04-24 14:43:16 +0000</bug_when>
    <thetext>Raised to a high priority since this is going to continue to happen on the YP AB.</thetext>
  </long_desc><long_desc isprivate="0" >
    <commentid>101761</commentid>
    <comment_count>5</comment_count>
    <who name="Mathieu Dubois-Briand">mathieu.dubois-briand</who>
    <bug_when>2025-04-28 12:06:56 +0000</bug_when>
    <thetext>oe-selftest-debian debian12-vk-7 mathieu/master-next completed at 2025-04-27T09:26:44Z
https://autobuilder.yoctoproject.org/valkyrie/#/builders/35/builds/1433/steps/14/logs/stdio

oe-selftest-debian debian11-vk-2 master completed at 2025-04-28T02:39:55Z
https://autobuilder.yoctoproject.org/valkyrie/#/builders/35/builds/1437/steps/14/logs/stdio</thetext>
  </long_desc><long_desc isprivate="0" >
    <commentid>101764</commentid>
    <comment_count>6</comment_count>
    <who name="Trevor Woerner">twoerner</who>
    <bug_when>2025-04-28 15:15:48 +0000</bug_when>
    <thetext>patch submitted: https://lists.openembedded.org/g/openembedded-core/topic/patch_oe_selftest_wic_add/112501814</thetext>
  </long_desc><long_desc isprivate="0" >
    <commentid>101774</commentid>
    <comment_count>7</comment_count>
    <who name="Mathieu Dubois-Briand">mathieu.dubois-briand</who>
    <bug_when>2025-04-29 13:45:53 +0000</bug_when>
    <thetext>oe-selftest-debian debian12-vk-9 master completed at 2025-04-29T02:38:41Z
https://autobuilder.yoctoproject.org/valkyrie/#/builders/35/builds/1446/steps/14/logs/stdio</thetext>
  </long_desc><long_desc isprivate="0" >
    <commentid>101790</commentid>
    <comment_count>8</comment_count>
    <who name="Trevor Woerner">twoerner</who>
    <bug_when>2025-05-01 03:39:36 +0000</bug_when>
    <thetext>new patch submitted: https://lists.openembedded.org/g/openembedded-core/topic/patch_v3_oe_selftest_wic/112553763</thetext>
  </long_desc><long_desc isprivate="0" >
    <commentid>101856</commentid>
    <comment_count>9</comment_count>
    <who name="Trevor Woerner">twoerner</who>
    <bug_when>2025-05-01 14:54:13 +0000</bug_when>
    <thetext>new patch succeeding on a debian worker on the AB: https://autobuilder.yoctoproject.org/valkyrie/#/builders/35/builds/1460/steps/14/logs/stdio

(line #1250)</thetext>
  </long_desc>
      
      

    </bug>

</bugzilla>