<?xml version="1.0" encoding="UTF-8" standalone="yes" ?>
<!DOCTYPE bugzilla SYSTEM "https://bugzilla.yoctoproject.org/page.cgi?id=bugzilla.dtd">

<bugzilla version="5.0.6"
          urlbase="https://bugzilla.yoctoproject.org/"
          
          maintainer="it-coreprojects-helpdesk@linuxfoundation.org"
>

    <bug>
          <bug_id>16029</bug_id>
          
          <creation_ts>2025-10-27 11:46:53 +0000</creation_ts>
          <short_desc>AB-INT: runqemu.QemuTest: fails in test_qemu_can_shutdown / test_qemu_can_boot_nfs_and_shutdown</short_desc>
          <delta_ts>2026-03-17 13:49:34 +0000</delta_ts>
          <reporter_accessible>1</reporter_accessible>
          <cclist_accessible>1</cclist_accessible>
          <classification_id>10</classification_id>
          <classification>QA/Testing</classification>
          <product>Functional (self) Testing</product>
          <component>oe-selftest</component>
          <version>unspecified</version>
          <rep_platform>x86</rep_platform>
          <op_sys>Multiple</op_sys>
          <bug_status>RESOLVED</bug_status>
          <resolution>OBSOLETE</resolution>
          
          
          <bug_file_loc></bug_file_loc>
          <status_whiteboard>AB-INT</status_whiteboard>
          <keywords></keywords>
          <priority>Medium</priority>
          <bug_severity>normal</bug_severity>
          <target_milestone>6.0</target_milestone>
          
          
          <everconfirmed>1</everconfirmed>
          <reporter name="Mathieu Dubois-Briand">mathieu.dubois-briand</reporter>
          <assigned_to name="Unassigned">unassigned</assigned_to>
          <cc>paul</cc>
    
    <cc>yoann.congal</cc>
          
          
          <cf_os>---</cf_os>
          <cf_regression_type>---</cf_regression_type>
          
          <cf_docchange>No (bug/feature does not impact docs)</cf_docchange>

      

      

      

          <comment_sort_order>oldest_to_newest</comment_sort_order>  
          <long_desc isprivate="0" >
    <commentid>103092</commentid>
    <comment_count>0</comment_count>
    <who name="Mathieu Dubois-Briand">mathieu.dubois-briand</who>
    <bug_when>2025-10-27 11:46:53 +0000</bug_when>
    <thetext>2025-10-24 07:05:36,641 - oe-selftest - INFO - runqemu.QemuTest.test_qemu_can_boot_nfs_and_shutdown (subunit.RemotedTestCase)
2025-10-24 07:05:36,646 - oe-selftest - INFO -  ... FAIL

Stderr:
2025-10-24 06:40:51,708 - oe-selftest - INFO - Adding: &quot;include selftest.inc&quot; in /srv/pokybuild/yocto-worker/qemuarm-tc/build/build-st-868439/conf/local.conf
2025-10-24 06:40:51,711 - oe-selftest - INFO - Adding: &quot;include bblayers.inc&quot; in bblayers.conf
2025-10-24 07:05:36,648 - oe-selftest - INFO - 10: 1/2 5/18 (0.17s) (0 failed) (runqemu.QemuTest.test_qemu_can_boot_nfs_and_shutdown)
2025-10-24 07:05:36,650 - oe-selftest - INFO - testtools.testresult.real._StringException: Traceback (most recent call last):
  File &quot;/srv/pokybuild/yocto-worker/qemuarm-tc/build/layers/openembedded-core/meta/lib/oeqa/selftest/cases/runqemu.py&quot;, line 236, in test_qemu_can_boot_nfs_and_shutdown
    self.assertExists(rootfs_tar)
  File &quot;/srv/pokybuild/yocto-worker/qemuarm-tc/build/layers/openembedded-core/meta/lib/oeqa/selftest/case.py&quot;, line 251, in assertExists
    raise self.failureException(msg)
AssertionError: &apos;/srv/pokybuild/yocto-worker/qemuarm-tc/build/build-st-868439/tmp/deploy/images/qemuarm/Bitbake still alive (no events for 600s). Active tasks:\ncore-image-minimal-qemuarm.rootfs.tar.bz2&apos; does not exist

---

2025-10-24 07:05:36,767 - oe-selftest - INFO - runqemu.QemuTest.test_qemu_can_shutdown (subunit.RemotedTestCase)
2025-10-24 07:05:36,770 - oe-selftest - INFO -  ... FAIL

Stderr:
2025-10-24 06:40:51,708 - oe-selftest - INFO - Adding: &quot;include selftest.inc&quot; in /srv/pokybuild/yocto-worker/qemuarm-tc/build/build-st-868439/conf/local.conf
2025-10-24 06:40:51,711 - oe-selftest - INFO - Adding: &quot;include bblayers.inc&quot; in bblayers.conf
2025-10-24 07:05:36,772 - oe-selftest - INFO - 10: 2/2 6/18 (0.13s) (2 failed) (runqemu.QemuTest.test_qemu_can_shutdown)
2025-10-24 07:05:36,774 - oe-selftest - INFO - testtools.testresult.real._StringException: Traceback (most recent call last):
  File &quot;/srv/pokybuild/yocto-worker/qemuarm-tc/build/layers/openembedded-core/meta/lib/oeqa/selftest/cases/runqemu.py&quot;, line 226, in test_qemu_can_shutdown
    self.assertExists(self.qemuboot_conf)
  File &quot;/srv/pokybuild/yocto-worker/qemuarm-tc/build/layers/openembedded-core/meta/lib/oeqa/selftest/case.py&quot;, line 251, in assertExists
    raise self.failureException(msg)
AssertionError: &apos;/srv/pokybuild/yocto-worker/qemuarm-tc/build/build-st-868439/tmp/deploy/images/qemuarm/Bitbake still alive (no events for 600s). Active tasks:\ncore-image-minimal-qemuarm.rootfs.qemuboot.conf&apos; does not exist</thetext>
  </long_desc><long_desc isprivate="0" >
    <commentid>103115</commentid>
    <comment_count>1</comment_count>
    <who name="Mathieu Dubois-Briand">mathieu.dubois-briand</who>
    <bug_when>2025-10-28 09:02:41 +0000</bug_when>
    <thetext>qemuarm-tc rocky9-vk-3 mathieu/master-next completed at 2025-10-24 13:24:13+00:00
https://valkyrie.yocto.io/pub/non-release/20251024-41/testresults/qemuarm-tc/
https://autobuilder.yoctoproject.org/valkyrie/#/builders/42/builds/2556/steps/13/logs/stdio</thetext>
  </long_desc><long_desc isprivate="0" >
    <commentid>104275</commentid>
    <comment_count>2</comment_count>
    <who name="Paul Barker">paul</who>
    <bug_when>2026-02-12 16:42:18 +0000</bug_when>
    <thetext>Closing this as obsolete as it hasn&apos;t been seen in a while and we&apos;ve fixed at least one issue in unfs3.

Related bugs:
- #14259
- #16113

We can re-open if this reoccurs.</thetext>
  </long_desc><long_desc isprivate="0" >
    <commentid>104681</commentid>
    <comment_count>3</comment_count>
    <who name="Yoann Congal">yoann.congal</who>
    <bug_when>2026-03-17 13:49:07 +0000</bug_when>
    <thetext>Also suspicious: this extract: (&quot;Bad file descriptor&quot; and &quot;TCG doesn&apos;t support requested feature&quot;)
runqemu - INFO - Cleaning up
runqemu - INFO - Host uptime: 630734.46

runqemu - INFO - Shutting down the userspace NFS server...
Getting sysroot...
PSEUDO=/srv/pokybuild/yocto-worker/qemux86-tc/build/build-st-1404072/tmp/work/x86_64-linux/qemu-helper-native/1.0/recipe-sysroot-native/usr/bin/pseudo
Stopping rpc.nfsd
Removing exports file
runqemu - INFO - Removing /srv/pokybuild/yocto-worker/qemux86-tc/build/build-st-1404072/tmp/deploy/images/qemux86/core-image-minimal-qemux86.rootfs-nfsroot
runqemu - INFO - Removing /srv/pokybuild/yocto-worker/qemux86-tc/build/build-st-1404072/tmp/deploy/images/qemux86/core-image-minimal-qemux86.rootfs-nfsroot.pseudo_state
tput: No value for $TERM and no -T specified

Extra log data exception OSError(9, &apos;Bad file descriptor&apos;)
Sending SIGTERM to runqemu
Output from runqemu:
runqemu - ERROR - Failed to run qemu: qemu-system-i386: -qmp unix:./.rwmgjbyo,server,wait: info: QEMU waiting for connection on: disconnected:unix:./.rwmgjbyo,server=on
qemu-system-i386: warning: TCG doesn&apos;t support requested feature: CPUID.01H:ECX.x2apic [bit 21]
qemu-system-i386: warning: TCG doesn&apos;t support requested feature: CPUID.01H:ECX.tsc-deadline [bit 24]
qemu-system-i386: warning: TCG doesn&apos;t support requested feature: CPUID.80000001H:EDX.lm [bit 29]
qemu-system-i386: warning: TCG doesn&apos;t support requested feature: CPUID.01H:ECX.x2apic [bit 21]
qemu-system-i386: warning: TCG doesn&apos;t support requested feature: CPUID.01H:ECX.tsc-deadline [bit 24]
qemu-system-i386: warning: TCG doesn&apos;t support requested feature: CPUID.80000001H:EDX.lm [bit 29]
qemu-system-i386: warning: TCG doesn&apos;t support requested feature: CPUID.01H:ECX.x2apic [bit 21]
qemu-system-i386: warning: TCG doesn&apos;t support requested feature: CPUID.01H:ECX.tsc-deadline [bit 24]
qemu-system-i386: warning: TCG doesn&apos;t support requested feature: CPUID.80000001H:EDX.lm [bit 29]
qemu-system-i386: warning: TCG doesn&apos;t support requested feature: CPUID.01H:ECX.x2apic [bit 21]
qemu-system-i386: warning: TCG doesn&apos;t support requested feature: CPUID.01H:ECX.tsc-deadline [bit 24]
qemu-system-i386: warning: TCG doesn&apos;t support requested feature: CPUID.80000001H:EDX.lm [bit 29]</thetext>
  </long_desc><long_desc isprivate="0" >
    <commentid>104682</commentid>
    <comment_count>4</comment_count>
    <who name="Yoann Congal">yoann.congal</who>
    <bug_when>2026-03-17 13:49:34 +0000</bug_when>
    <thetext>wrong bug, sorry</thetext>
  </long_desc>
      
      

    </bug>

</bugzilla>