<?xml version="1.0" encoding="UTF-8" standalone="yes" ?>
<!DOCTYPE bugzilla SYSTEM "https://bugzilla.yoctoproject.org/page.cgi?id=bugzilla.dtd">

<bugzilla version="5.0.6"
          urlbase="https://bugzilla.yoctoproject.org/"
          
          maintainer="it-coreprojects-helpdesk@linuxfoundation.org"
>

    <bug>
          <bug_id>16188</bug_id>
          
          <creation_ts>2026-03-04 12:11:40 +0000</creation_ts>
          <short_desc>AB-INT: llvm-lit: unable to find test suite for &apos;../test&apos;</short_desc>
          <delta_ts>2026-04-15 04:38:01 +0000</delta_ts>
          <reporter_accessible>1</reporter_accessible>
          <cclist_accessible>1</cclist_accessible>
          <classification_id>7</classification_id>
          <classification>Build System, Metadata &amp; Runtime</classification>
          <product>OE-Core</product>
          <component>devtools / tool chain</component>
          <version>5.99</version>
          <rep_platform>x86</rep_platform>
          <op_sys>Multiple</op_sys>
          <bug_status>RESOLVED</bug_status>
          <resolution>NOTABUG</resolution>
          
          
          <bug_file_loc></bug_file_loc>
          <status_whiteboard>AB-INT</status_whiteboard>
          <keywords></keywords>
          <priority>Medium+</priority>
          <bug_severity>normal</bug_severity>
          <target_milestone>6.0 M3</target_milestone>
          
          
          <everconfirmed>1</everconfirmed>
          <reporter name="Mathieu Dubois-Briand">mathieu.dubois-briand</reporter>
          <assigned_to name="Deepesh Varatharajan">deepesh.varatharajan</assigned_to>
          <cc>alex.kanavin</cc>
    
    <cc>deepesh.varatharajan</cc>
    
    <cc>meta.mr.watcher</cc>
    
    <cc>meta.watcher</cc>
    
    <cc>randy.macleod</cc>
          
          
          <cf_os>---</cf_os>
          <cf_regression_type>---</cf_regression_type>
          
          <cf_docchange>No (bug/feature does not impact docs)</cf_docchange>

      

      

      

          <comment_sort_order>oldest_to_newest</comment_sort_order>  
          <long_desc isprivate="0" >
    <commentid>104487</commentid>
    <comment_count>0</comment_count>
    <who name="Mathieu Dubois-Briand">mathieu.dubois-briand</who>
    <bug_when>2026-03-04 12:11:40 +0000</bug_when>
    <thetext>Some new AB-INT, probably only in my branch so far.

2026-03-03 12:10:25,917 - oe-selftest - INFO - clang.LLVMSelfTestSystemEmulated.test_llvm (subunit.RemotedTestCase)
2026-03-03 12:10:25,918 - oe-selftest - INFO -  ... FAIL
...
2026-03-03 12:10:25,918 - oe-selftest - INFO - 3: 1/1 9/21 (2291.61s) (0 failed) (clang.LLVMSelfTestSystemEmulated.test_llvm)
2026-03-03 12:10:25,918 - oe-selftest - INFO - testtools.testresult.real._StringException: Traceback (most recent call last):
  File &quot;/srv/pokybuild/yocto-worker/qemux86-64-tc/build/layers/openembedded-core/meta/lib/oeqa/core/decorator/__init__.py&quot;, line 35, in wrapped_f
    return func(*args, **kwargs)
  File &quot;/srv/pokybuild/yocto-worker/qemux86-64-tc/build/layers/openembedded-core/meta/lib/oeqa/selftest/cases/clang.py&quot;, line 185, in test_llvm
    raise AssertionError(f&quot;llvm-lit failed for LLVM: {output}&quot;)
AssertionError: llvm-lit failed for LLVM: llvm-lit: /srv/pokybuild/yocto-worker/qemux86-64-tc/build/build-st-1448570/tmp/work-shared/llvm-project-source-21.1.8-r1/sources/llvm-project-21.1.8.src/llvm/utils/lit/lit/discovery.py:137: warning: unable to find test suite for &apos;../test&apos;
llvm-lit: /srv/pokybuild/yocto-worker/qemux86-64-tc/build/build-st-1448570/tmp/work-shared/llvm-project-source-21.1.8-r1/sources/llvm-project-21.1.8.src/llvm/utils/lit/lit/discovery.py:276: warning: input &apos;../test&apos; contained no tests
error: did not discover any tests for provided path(s)

I&apos;ve been discussing this with Deepesh, he might come with more data.</thetext>
  </long_desc><long_desc isprivate="0" >
    <commentid>104488</commentid>
    <comment_count>1</comment_count>
    <who name="Mathieu Dubois-Briand">mathieu.dubois-briand</who>
    <bug_when>2026-03-04 12:12:45 +0000</bug_when>
    <thetext>qemux86-64-tc ubuntu2504-vk-1 mathieu/master-next&amp;mathieu/master-next-tests completed at 2026-03-03 13:49:07+00:00
https://valkyrie.yocto.io/pub/non-release/20260303-71/testresults/qemux86-64-tc/
https://autobuilder.yoctoproject.org/valkyrie/#/builders/66/builds/3322/steps/13/logs/stdio

qemuarm-tc ubuntu2204-vk-3 mathieu/master-next&amp;mathieu/master-next-tests completed at 2026-03-03 21:05:27+00:00
https://valkyrie.yocto.io/pub/non-release/20260303-86/testresults/qemuarm-tc/
https://autobuilder.yoctoproject.org/valkyrie/#/builders/42/builds/3230/steps/13/logs/stdio</thetext>
  </long_desc><long_desc isprivate="0" >
    <commentid>104521</commentid>
    <comment_count>2</comment_count>
    <who name="Randy MacLeod">randy.macleod</who>
    <bug_when>2026-03-05 15:42:07 +0000</bug_when>
    <thetext>Alex to reply on list.</thetext>
  </long_desc><long_desc isprivate="0" >
    <commentid>104543</commentid>
    <comment_count>3</comment_count>
    <who name="Alexander Kanavin">alex.kanavin</who>
    <bug_when>2026-03-05 18:40:38 +0000</bug_when>
    <thetext>@Randy I am not familiar with this issue, and I wasn&apos;t on the triage call, so I&apos;m not sure what I need to reply with. Did you mean someone else?</thetext>
  </long_desc><long_desc isprivate="0" >
    <commentid>104544</commentid>
    <comment_count>4</comment_count>
    <who name="Randy MacLeod">randy.macleod</who>
    <bug_when>2026-03-05 20:10:45 +0000</bug_when>
    <thetext>Alex,

RP mentioned that you were going to follow-up on this.
I think his context was from the patch review call not the bug triage call.

Does that ring a bell ?</thetext>
  </long_desc><long_desc isprivate="0" >
    <commentid>104545</commentid>
    <comment_count>5</comment_count>
    <who name="Alexander Kanavin">alex.kanavin</who>
    <bug_when>2026-03-05 20:12:26 +0000</bug_when>
    <thetext>Not this. 

I was going to follow up on https://bugzilla.yoctoproject.org/show_bug.cgi?id=16058#c72 (and did). It&apos;s a different issue.</thetext>
  </long_desc><long_desc isprivate="0" >
    <commentid>104548</commentid>
    <comment_count>6</comment_count>
    <who name="Mathieu Dubois-Briand">mathieu.dubois-briand</who>
    <bug_when>2026-03-06 06:05:45 +0000</bug_when>
    <thetext>Sorry, I missed that one during patch review.

So this entry was kind of opened by error: the issue is only present in my branch, and what I missed at first, the failing test is a new one, only present in my branch. So this should have been handled directly on the mailing list, not on bugzilla.

Said patches was submitted by Deepesh, he is aware of this.</thetext>
  </long_desc><long_desc isprivate="0" >
    <commentid>105072</commentid>
    <comment_count>7</comment_count>
    <who name="Deepesh Varatharajan">deepesh.varatharajan</who>
    <bug_when>2026-04-15 04:38:01 +0000</bug_when>
    <thetext>As this issue only affected in the testing branch and is caused by newly added test that is not present in oe-core master yet, it is not a bug. The patch series was not merged yet, and the reported problem has already been fixed. So, closing this issue accordingly.</thetext>
  </long_desc>
      
      

    </bug>

</bugzilla>