<?xml version="1.0" encoding="UTF-8" standalone="yes" ?>
<!DOCTYPE bugzilla SYSTEM "https://bugzilla.yoctoproject.org/page.cgi?id=bugzilla.dtd">

<bugzilla version="5.0.6"
          urlbase="https://bugzilla.yoctoproject.org/"
          
          maintainer="it-coreprojects-helpdesk@linuxfoundation.org"
>

    <bug>
          <bug_id>16249</bug_id>
          
          <creation_ts>2026-04-16 07:02:34 +0000</creation_ts>
          <short_desc>AB-INT: groff: error: couldn&apos;t exec eqn: No such file or directory</short_desc>
          <delta_ts>2026-05-04 08:48:00 +0000</delta_ts>
          <reporter_accessible>1</reporter_accessible>
          <cclist_accessible>1</cclist_accessible>
          <classification_id>7</classification_id>
          <classification>Build System, Metadata &amp; Runtime</classification>
          <product>OE-Core</product>
          <component>oe-core other</component>
          <version>5.99</version>
          <rep_platform>x86</rep_platform>
          <op_sys>Multiple</op_sys>
          <bug_status>RESOLVED</bug_status>
          <resolution>FIXED</resolution>
          
          
          <bug_file_loc></bug_file_loc>
          <status_whiteboard>AB-INT</status_whiteboard>
          <keywords></keywords>
          <priority>Medium</priority>
          <bug_severity>normal</bug_severity>
          <target_milestone>6.1</target_milestone>
          
          
          <everconfirmed>1</everconfirmed>
          <reporter name="Mathieu Dubois-Briand">mathieu.dubois-briand</reporter>
          <assigned_to name="Unassigned">unassigned</assigned_to>
          <cc>randy.macleod</cc>
    
    <cc>richard.purdie</cc>
          
          
          <cf_os>---</cf_os>
          <cf_regression_type>---</cf_regression_type>
          
          <cf_docchange>No (bug/feature does not impact docs)</cf_docchange>

      

      

      

          <comment_sort_order>oldest_to_newest</comment_sort_order>  
          <long_desc isprivate="0" >
    <commentid>105098</commentid>
    <comment_count>0</comment_count>
    <who name="Mathieu Dubois-Briand">mathieu.dubois-briand</who>
    <bug_when>2026-04-16 07:02:34 +0000</bug_when>
    <thetext>Groff build failure on the autobuilder.

ERROR: groff-native-1.24.0-r0 do_compile: Execution of &apos;/srv/pokybuild/yocto-worker/genericx86-64-alt/build/build/tmp/work/x86_64-linux/groff-native/1.24.0/temp/run.do_compile.1488651&apos; failed with exit code 1
...
| /srv/pokybuild/yocto-worker/genericx86-64-alt/build/build/tmp/work/x86_64-linux/groff-native/1.24.0/sources/groff-1.24.0/groff: error: couldn&apos;t exec eqn: No such file or directory
| pdfmom: fatal error: /srv/pokybuild/yocto-worker/genericx86-64-alt/build/build/tmp/work/x86_64-linux/groff-native/1.24.0/sources/groff-1.24.0/test-groff exited with status 24
| make[2]: *** [Makefile:19256: doc/automake.pdf] Error 1
| make[2]: *** Deleting file &apos;doc/automake.pdf&apos;
| make[2]: Leaving directory &apos;/srv/pokybuild/yocto-worker/genericx86-64-alt/build/build/tmp/work/x86_64-linux/groff-native/1.24.0/sources/groff-1.24.0&apos;
| make[1]: *** [Makefile:13325: all-recursive] Error 1
| make[1]: Leaving directory &apos;/srv/pokybuild/yocto-worker/genericx86-64-alt/build/build/tmp/work/x86_64-linux/groff-native/1.24.0/sources/groff-1.24.0&apos;
| make: *** [Makefile:7587: all] Error 2
| ERROR: oe_runmake failed

Might be similar to https://bugzilla.yoctoproject.org/show_bug.cgi?id=15610.</thetext>
  </long_desc><long_desc isprivate="0" >
    <commentid>105101</commentid>
    <comment_count>1</comment_count>
    <who name="Mathieu Dubois-Briand">mathieu.dubois-briand</who>
    <bug_when>2026-04-16 07:10:34 +0000</bug_when>
    <thetext>genericx86-64-alt debian12-vk-6 mathieu/master-next completed at 2026-04-15 12:29:38+00:00
https://autobuilder.yoctoproject.org/valkyrie/#/builders/93/builds/3590/steps/12/logs/stdio</thetext>
  </long_desc><long_desc isprivate="0" >
    <commentid>105109</commentid>
    <comment_count>2</comment_count>
    <who name="Richard Purdie">richard.purdie</who>
    <bug_when>2026-04-16 14:47:38 +0000</bug_when>
    <thetext>Looks like a makefile race, needs to build eqn before running it</thetext>
  </long_desc><long_desc isprivate="0" >
    <commentid>105169</commentid>
    <comment_count>3</comment_count>
    <who name="Mathieu Dubois-Briand">mathieu.dubois-briand</who>
    <bug_when>2026-04-21 07:08:57 +0000</bug_when>
    <thetext>genericx86-64-alt alma9-vk-2 master-next&amp;master completed at 2026-04-20 23:38:31+00:00
https://autobuilder.yoctoproject.org/valkyrie/#/builders/93/builds/3618/steps/13/logs/stdio</thetext>
  </long_desc><long_desc isprivate="0" >
    <commentid>105229</commentid>
    <comment_count>4</comment_count>
    <who name="Richard Purdie">richard.purdie</who>
    <bug_when>2026-04-23 15:14:13 +0000</bug_when>
    <thetext>https://git.openembedded.org/openembedded-core/commit/?id=d1a02bdd2426ac1ed94b5d1d54f5d0c15d4c1b09</thetext>
  </long_desc><long_desc isprivate="0" >
    <commentid>105267</commentid>
    <comment_count>5</comment_count>
    <who name="Mathieu Dubois-Briand">mathieu.dubois-briand</who>
    <bug_when>2026-04-27 08:24:22 +0000</bug_when>
    <thetext>This failed, while having the &quot;groff: Fix occasional build race failure&quot; commit.

genericx86-64 rocky8-vk-1 mathieu/master-next completed at 2026-04-24 08:05:15+00:00
https://autobuilder.yoctoproject.org/valkyrie/#/builders/4/builds/3680/steps/13/logs/stdio</thetext>
  </long_desc><long_desc isprivate="0" >
    <commentid>105346</commentid>
    <comment_count>6</comment_count>
    <who name="Mathieu Dubois-Briand">mathieu.dubois-briand</who>
    <bug_when>2026-05-04 08:48:00 +0000</bug_when>
    <thetext>Now we have:
| /srv/pokybuild/yocto-worker/qemuarm64-armhost/build/build/tmp/work/aarch64-linux/groff-native/1.24.1/sources/groff-1.24.1/groff: error: couldn&apos;t exec pic: No such file or directory
| /srv/pokybuild/yocto-worker/qemuarm64-armhost/build/build/tmp/work/aarch64-linux/groff-native/1.24.1/sources/groff-1.24.1/groff: error: couldn&apos;t exec eqn: Permission denied

qemuarm64-armhost debian13-vk-arm1 master&amp;master-next completed at 2026-05-02 15:57:20+00:00
https://autobuilder.yoctoproject.org/valkyrie/#/builders/8/builds/3741/steps/16/logs/stdio

musl-qemux86-64 debian12-vk-2 mathieu/master-next completed at 2026-05-03 15:41:29+00:00
https://autobuilder.yoctoproject.org/valkyrie/#/builders/3/builds/3764/steps/12/logs/stdio

qa-extras2 stream9-vk-1 mathieu/master-next completed at 2026-05-03 16:37:31+00:00
https://autobuilder.yoctoproject.org/valkyrie/#/builders/26/builds/3676/steps/13/logs/stdio</thetext>
  </long_desc>
      
      

    </bug>

</bugzilla>