<?xml version="1.0" encoding="UTF-8" standalone="yes" ?>
<!DOCTYPE bugzilla SYSTEM "https://bugzilla.yoctoproject.org/page.cgi?id=bugzilla.dtd">

<bugzilla version="5.0.6"
          urlbase="https://bugzilla.yoctoproject.org/"
          
          maintainer="it-coreprojects-helpdesk@linuxfoundation.org"
>

    <bug>
          <bug_id>16372</bug_id>
          
          <creation_ts>2026-07-22 15:07:55 +0000</creation_ts>
          <short_desc>AB-INT: bblayers.BitbakeLayers.test_bitbakelayers_showcrossdepends fails</short_desc>
          <delta_ts>2026-07-23 14:48:53 +0000</delta_ts>
          <reporter_accessible>1</reporter_accessible>
          <cclist_accessible>1</cclist_accessible>
          <classification_id>10</classification_id>
          <classification>QA/Testing</classification>
          <product>Functional (self) Testing</product>
          <component>oe-selftest</component>
          <version>unspecified</version>
          <rep_platform>x86</rep_platform>
          <op_sys>Multiple</op_sys>
          <bug_status>NEW</bug_status>
          <resolution></resolution>
          
          
          <bug_file_loc></bug_file_loc>
          <status_whiteboard>AB-INT</status_whiteboard>
          <keywords></keywords>
          <priority>Medium</priority>
          <bug_severity>normal</bug_severity>
          <target_milestone>6.1</target_milestone>
          
          
          <everconfirmed>1</everconfirmed>
          <reporter name="Mathieu Dubois-Briand">mathieu.dubois-briand</reporter>
          <assigned_to name="Unassigned">unassigned</assigned_to>
          <cc>randy.macleod</cc>
          
          
          <cf_os>---</cf_os>
          <cf_regression_type>---</cf_regression_type>
          
          <cf_docchange>No (bug/feature does not impact docs)</cf_docchange>

      

      

      

          <comment_sort_order>oldest_to_newest</comment_sort_order>  
          <long_desc isprivate="0" >
    <commentid>106266</commentid>
    <comment_count>0</comment_count>
    <who name="Mathieu Dubois-Briand">mathieu.dubois-briand</who>
    <bug_when>2026-07-22 15:07:55 +0000</bug_when>
    <thetext>So the issue is seen during the selftest, but I&apos;m not sure if the issue is really there or something inside bitbake. Also, we have a similar failures on two tests:
- bblayers.BitbakeLayers.test_bitbakelayers_showcrossdepends
- bblayers.BitbakeLayers.test_bitbakelayers_showoverlayed

2026-07-14 01:28:32,893 - oe-selftest - INFO - bblayers.BitbakeLayers.test_bitbakelayers_showcrossdepends (subunit.RemotedTestCase)
2026-07-14 01:28:32,894 - oe-selftest - INFO -  ... FAIL

Stderr:
2026-07-14 01:23:42,305 - oe-selftest - INFO - Adding: &quot;include selftest.inc&quot; in /srv/pokybuild/yocto-worker/oe-selftest-fedora/build/build-st-3296643/conf/local.conf
2026-07-14 01:23:42,306 - oe-selftest - INFO - Adding: &quot;include bblayers.inc&quot; in bblayers.conf
/usr/lib64/python3.14/unittest/case.py:606: RuntimeWarning: TestResult has no addDuration method
  warnings.warn(&quot;TestResult has no addDuration method&quot;,

/usr/lib64/python3.14/unittest/case.py:606: RuntimeWarning: TestResult has no addDuration method
  warnings.warn(&quot;TestResult has no addDuration method&quot;,

/usr/lib64/python3.14/unittest/case.py:606: RuntimeWarning: TestResult has no addDuration method
  warnings.warn(&quot;TestResult has no addDuration method&quot;,

2026-07-14 01:28:32,895 - oe-selftest - INFO - 6: 7/29 69/693 (123.44s) (0 failed) (bblayers.BitbakeLayers.test_bitbakelayers_showcrossdepends)
2026-07-14 01:28:32,895 - oe-selftest - INFO - testtools.testresult.real._StringException: Traceback (most recent call last):
  File &quot;/srv/pokybuild/yocto-worker/oe-selftest-fedora/build/layers/openembedded-core/meta/lib/oeqa/selftest/cases/bblayers.py&quot;, line 35, in test_bitbakelayers_showcrossdepends
    result = runCmd(&apos;bitbake-layers show-cross-depends&apos;)
  File &quot;/srv/pokybuild/yocto-worker/oe-selftest-fedora/build/layers/openembedded-core/meta/lib/oeqa/utils/commands.py&quot;, line 214, in runCmd
    raise AssertionError(&quot;Command &apos;%s&apos; returned non-zero exit status %d:\n%s&quot; % (command, result.status, exc_output))
AssertionError: Command &apos;bitbake-layers show-cross-depends&apos; returned non-zero exit status 1:
NOTE: Reconnecting to bitbake server...
Loading cache...done.
Loaded 2077 entries from dependency cache.
NOTE: No reply from server in 30s (for command getRecipeInherits at 01:27:02.486757)
NOTE: No reply from server in 30s (for command clientComplete at 01:28:02.546967)
Timeout while waiting for a reply from the bitbake server (60s at 01:28:32.556884)</thetext>
  </long_desc><long_desc isprivate="0" >
    <commentid>106267</commentid>
    <comment_count>1</comment_count>
    <who name="Mathieu Dubois-Briand">mathieu.dubois-briand</who>
    <bug_when>2026-07-22 15:08:52 +0000</bug_when>
    <thetext>oe-selftest-fedora fedora43-vk-2 master completed at 2026-07-14 03:21:06+00:00
https://autobuilder.yoctoproject.org/valkyrie/#/builders/48/builds/4100/steps/15/logs/stdio</thetext>
  </long_desc><long_desc isprivate="0" >
    <commentid>106298</commentid>
    <comment_count>2</comment_count>
    <who name="Randy MacLeod">randy.macleod</who>
    <bug_when>2026-07-23 14:48:53 +0000</bug_when>
    <thetext>Need the cooker log if this happens again.
Likely load related.</thetext>
  </long_desc>
      
      

    </bug>

</bugzilla>