<?xml version="1.0" encoding="UTF-8" standalone="yes" ?>
<!DOCTYPE bugzilla SYSTEM "https://bugzilla.yoctoproject.org/page.cgi?id=bugzilla.dtd">

<bugzilla version="5.0.6"
          urlbase="https://bugzilla.yoctoproject.org/"
          
          maintainer="it-coreprojects-helpdesk@linuxfoundation.org"
>

    <bug>
          <bug_id>16412</bug_id>
          
          <creation_ts>2026-08-31 09:38:08 +0000</creation_ts>
          <short_desc>AB-INT PTEST: python3 ptest failure: in test_attach_to_process_without_colors</short_desc>
          <delta_ts>2026-09-10 15:08:18 +0000</delta_ts>
          <reporter_accessible>1</reporter_accessible>
          <cclist_accessible>1</cclist_accessible>
          <classification_id>10</classification_id>
          <classification>QA/Testing</classification>
          <product>Package Testing (ptest)</product>
          <component>ptest</component>
          <version>unspecified</version>
          <rep_platform>x86</rep_platform>
          <op_sys>Multiple</op_sys>
          <bug_status>RESOLVED</bug_status>
          <resolution>FIXED</resolution>
          
          
          <bug_file_loc></bug_file_loc>
          <status_whiteboard>AB-INT</status_whiteboard>
          <keywords></keywords>
          <priority>Medium</priority>
          <bug_severity>normal</bug_severity>
          <target_milestone>6.1</target_milestone>
          
          
          <everconfirmed>1</everconfirmed>
          <reporter name="João Marcos Costa">joaomarcos.costa</reporter>
          <assigned_to name="Pratik Farkase">pratik.farkase</assigned_to>
          <cc>randy.macleod</cc>
    
    <cc>richard.purdie</cc>
          
          
          <cf_os>---</cf_os>
          <cf_regression_type>---</cf_regression_type>
          
          <cf_docchange>Don&apos;t know</cf_docchange>

      

      

      

          <comment_sort_order>oldest_to_newest</comment_sort_order>  
          <long_desc isprivate="0" >
    <commentid>106685</commentid>
    <comment_count>0</comment_count>
    <who name="João Marcos Costa">joaomarcos.costa</who>
    <bug_when>2026-08-31 09:38:08 +0000</bug_when>
    <thetext>https://autobuilder.yoctoproject.org/valkyrie/#/builders/61/builds/4413/steps/15/logs/stdio

Failed ptests:
{&apos;python3&apos;: [&apos;test_attach_to_process_without_colors&apos;, &apos;python3&apos;]}

qemuarm64-ptest ubuntu2604-vk-arm1

---

Full logs at https://valkyrie.yocto.io/pub/non-release/20260830-58/testresults/qemuarm64-ptest/python3.log

&quot;&quot;&quot;
======================================================================
FAIL: test_attach_to_process_without_colors (test.test_remote_pdb.PdbAttachTestCase.test_attach_to_process_without_colors)
----------------------------------------------------------------------
Traceback (most recent call last):
  File &quot;/usr/lib/python3.14/test/test_remote_pdb.py&quot;, line 1606, in test_attach_to_process_without_colors
    self.assertEqual(output[&quot;server&quot;][&quot;stdout&quot;], &quot;Function returned: 42\n&quot;)
    ~~~~~~~~~~~~~~~~^^^^^^^^^^^^^^^^^^^^^^^^^^^^^^^^^^^^^^^^^^^^^^^^^^^^^^^
AssertionError: &apos;Function returned: 1\n&apos; != &apos;Function returned: 42\n&apos;
- Function returned: 1
?                    ^
+ Function returned: 42
?                    ^^


----------------------------------------------------------------------
Ran 45 tests in 12.544s

FAILED (failures=1, skipped=1)
test test_remote_pdb failed
&quot;&quot;&quot;</thetext>
  </long_desc><long_desc isprivate="0" >
    <commentid>106793</commentid>
    <comment_count>1</comment_count>
    <who name="Randy MacLeod">randy.macleod</who>
    <bug_when>2026-09-10 15:08:18 +0000</bug_when>
    <thetext>Fixed, thanks!
https://git.openembedded.org/openembedded-core/commit/?id=8c4711e497cbf7c1c96d8f2e529767aca5ef84b0</thetext>
  </long_desc>
      
      

    </bug>

</bugzilla>