<?xml version="1.0" encoding="UTF-8" standalone="yes" ?>
<!DOCTYPE bugzilla SYSTEM "https://bugzilla.yoctoproject.org/page.cgi?id=bugzilla.dtd">

<bugzilla version="5.0.6"
          urlbase="https://bugzilla.yoctoproject.org/"
          
          maintainer="it-coreprojects-helpdesk@linuxfoundation.org"
>

    <bug>
          <bug_id>16414</bug_id>
          
          <creation_ts>2026-09-02 09:03:07 +0000</creation_ts>
          <short_desc>AB-INT: testsdk: kernel-module-hello-world build fail</short_desc>
          <delta_ts>2026-09-08 09:35:43 +0000</delta_ts>
          <reporter_accessible>1</reporter_accessible>
          <cclist_accessible>1</cclist_accessible>
          <classification_id>10</classification_id>
          <classification>QA/Testing</classification>
          <product>Runtime Testing</product>
          <component>testsdk</component>
          <version>unspecified</version>
          <rep_platform>x86</rep_platform>
          <op_sys>Multiple</op_sys>
          <bug_status>RESOLVED</bug_status>
          <resolution>FIXED</resolution>
          
          
          <bug_file_loc></bug_file_loc>
          <status_whiteboard>AB-INT</status_whiteboard>
          <keywords></keywords>
          <priority>High</priority>
          <bug_severity>normal</bug_severity>
          <target_milestone>6.1 M3</target_milestone>
          
          
          <everconfirmed>1</everconfirmed>
          <reporter name="Mathieu Dubois-Briand">mathieu.dubois-briand</reporter>
          <assigned_to name="Ross Burton">ross.burton</assigned_to>
          <cc>bruce.ashfield</cc>
    
    <cc>randy.macleod</cc>
    
    <cc>richard.purdie</cc>
    
    <cc>yoann.congal</cc>
          
          
          <cf_os>---</cf_os>
          <cf_regression_type>---</cf_regression_type>
          
          <cf_docchange>No (bug/feature does not impact docs)</cf_docchange>

      

      

      

          <comment_sort_order>oldest_to_newest</comment_sort_order>  
          <long_desc isprivate="0" >
    <commentid>106699</commentid>
    <comment_count>0</comment_count>
    <who name="Mathieu Dubois-Briand">mathieu.dubois-briand</who>
    <bug_when>2026-09-02 09:03:07 +0000</bug_when>
    <thetext>We had this error a few times over the last days, only in Richard branch and mine so far.

Patch breaking the build is not identified so far.

oeqa.utils.subprocesstweak.OETestCalledProcessError: Command &apos;. /srv/pokybuild/yocto-worker/qemuarm/build/build/tmp/work/qemuarm-poky-linux-gnueabi/core-image-minimal/1.0/testsdkext/environment-setup-cortexa15t2hf-neon-poky-linux-gnueabi &gt; /dev/null; devtool build kernel-module-hello-world;&apos; returned non-zero exit status 1.
...
ERROR: kernel-module-hello-world-1.0+git-r0 do_install: Execution of &apos;/srv/pokybuild/yocto-worker/qemuarm/build/build/tmp/work/qemuarm-poky-linux-gnueabi/core-image-minimal/1.0/testsdkext/tmp/work/qemuarm-poky-linux-gnueabi/kernel-module-hello-world/1.0+git/temp/run.do_install.1155262&apos; failed with exit code 1
...
| make -C /srv/pokybuild/yocto-worker/qemuarm/build/build/tmp/work/qemuarm-poky-linux-gnueabi/core-image-minimal/1.0/testsdkext/tmp/work-shared/qemuarm/kernel-source M=/srv/pokybuild/yocto-worker/qemuarm/build/build/tmp/work/qemuarm-poky-linux-gnueabi/core-image-minimal/1.0/testsdkext/workspace/sources/kernel-module-hello-world modules_install
...
| make[4]: *** No rule to make target &apos;/srv/pokybuild/yocto-worker/qemuarm/build/build/tmp/work/qemuarm-poky-linux-gnueabi/core-image-minimal/1.0/testsdkext/tmp/work/qemuarm-poky-linux-gnueabi/kernel-module-hello-world/1.0+git/image/lib/modules/6.18.44-yocto-standard/updates/hello-world.ko&apos;, needed by &apos;__modinst&apos;.  Stop.
| make[3]: *** [/srv/pokybuild/yocto-worker/qemuarm/build/build/tmp/work/qemuarm-poky-linux-gnueabi/core-image-minimal/1.0/testsdkext/tmp/work-shared/qemuarm/kernel-source/Makefile:1956: modules_install] Error 2
| make[2]: *** [/srv/pokybuild/yocto-worker/qemuarm/build/build/tmp/work/qemuarm-poky-linux-gnueabi/core-image-minimal/1.0/testsdkext/tmp/work-shared/qemuarm/kernel-source/Makefile:248: __sub-make] Error 2
| make[2]: Leaving directory &apos;/srv/pokybuild/yocto-worker/qemuarm/build/build/tmp/work/qemuarm-poky-linux-gnueabi/core-image-minimal/1.0/testsdkext/workspace/sources/kernel-module-hello-world&apos;
| make[1]: Leaving directory &apos;/srv/pokybuild/yocto-worker/qemuarm/build/build/tmp/work/qemuarm-poky-linux-gnueabi/core-image-minimal/1.0/testsdkext/tmp/work-shared/qemuarm/kernel-source&apos;
| make[1]: *** [Makefile:248: __sub-make] Error 2
| make: *** [Makefile:9: modules_install] Error 2
| ERROR: oe_runmake failed</thetext>
  </long_desc><long_desc isprivate="0" >
    <commentid>106700</commentid>
    <comment_count>1</comment_count>
    <who name="Mathieu Dubois-Briand">mathieu.dubois-briand</who>
    <bug_when>2026-09-02 09:05:12 +0000</bug_when>
    <thetext>qemuarm ubuntu2504-vk-1 master-next&amp;master completed at 2026-08-30 09:32:24+00:00
https://autobuilder.yoctoproject.org/valkyrie/#/builders/16/builds/4555/steps/17/logs/stdio

qemux86 ubuntu2504-vk-1 mathieu/master-next completed at 2026-09-01 07:49:56+00:00
https://autobuilder.yoctoproject.org/valkyrie/#/builders/30/builds/4514/steps/16/logs/stdio

qemuarm ubuntu2510-vk-1 mathieu/master-next completed at 2026-09-01 11:37:24+00:00
https://autobuilder.yoctoproject.org/valkyrie/#/builders/16/builds/4568/steps/16/logs/stdio

qemux86 ubuntu2510-vk-1 mathieu/master-next completed at 2026-09-01 11:37:46+00:00
https://autobuilder.yoctoproject.org/valkyrie/#/builders/30/builds/4516/steps/16/logs/stdio</thetext>
  </long_desc><long_desc isprivate="0" >
    <commentid>106707</commentid>
    <comment_count>2</comment_count>
    <who name="Mathieu Dubois-Briand">mathieu.dubois-briand</who>
    <bug_when>2026-09-03 08:11:28 +0000</bug_when>
    <thetext>qemuarm64 fedora44-vk-1 mathieu/master-next completed at 2026-09-02 09:03:00+00:00
https://autobuilder.yoctoproject.org/valkyrie/#/builders/36/builds/4536/steps/16/logs/stdio

qemuarmv5 ubuntu2504-vk-1 mathieu/master-next completed at 2026-09-02 15:54:21+00:00
https://autobuilder.yoctoproject.org/valkyrie/#/builders/80/builds/4383/steps/16/logs/stdio

qemuriscv64 ubuntu2510-vk-1 master-next completed at 2026-09-02 19:35:36+00:00
https://autobuilder.yoctoproject.org/valkyrie/#/builders/45/builds/2262/steps/17/logs/stdio

qemux86 ubuntu2510-vk-1 master-next completed at 2026-09-02 19:33:55+00:00
https://autobuilder.yoctoproject.org/valkyrie/#/builders/30/builds/4532/steps/17/logs/stdio

qemuarm fedora43-vk-2 mathieu/master-next completed at 2026-09-02 19:29:48+00:00
https://autobuilder.yoctoproject.org/valkyrie/#/builders/16/builds/4585/steps/16/logs/stdio

qemuarm ubuntu2510-vk-1 master-next completed at 2026-09-02 21:49:05+00:00
https://autobuilder.yoctoproject.org/valkyrie/#/builders/16/builds/4587/steps/17/logs/stdio

qemux86 fedora43-vk-2 master-next completed at 2026-09-02 21:30:58+00:00
https://autobuilder.yoctoproject.org/valkyrie/#/builders/30/builds/4534/steps/17/logs/stdio

qemuarmv5 ubuntu2510-vk-1 master-next completed at 2026-09-03 07:31:42+00:00
https://autobuilder.yoctoproject.org/valkyrie/#/builders/80/builds/4390/steps/17/logs/stdio

qemuriscv64 fedora43-vk-2 master-next completed at 2026-09-03 07:52:29+00:00
https://autobuilder.yoctoproject.org/valkyrie/#/builders/45/builds/2267/steps/17/logs/stdio</thetext>
  </long_desc><long_desc isprivate="0" >
    <commentid>106731</commentid>
    <comment_count>3</comment_count>
    <who name="Mathieu Dubois-Briand">mathieu.dubois-briand</who>
    <bug_when>2026-09-04 12:03:57 +0000</bug_when>
    <thetext>qemuarm ubuntu2504-vk-1 mathieu/master-next completed at 2026-09-03 14:22:03+00:00
https://autobuilder.yoctoproject.org/valkyrie/#/builders/16/builds/4593/steps/16/logs/stdio

qemuarm fedora43-vk-2 mathieu/master-next completed at 2026-09-04 07:53:18+00:00
https://autobuilder.yoctoproject.org/valkyrie/#/builders/16/builds/4601/steps/16/logs/stdio</thetext>
  </long_desc><long_desc isprivate="0" >
    <commentid>106742</commentid>
    <comment_count>4</comment_count>
    <who name="Mathieu Dubois-Briand">mathieu.dubois-briand</who>
    <bug_when>2026-09-06 16:12:28 +0000</bug_when>
    <thetext>qemux86 debian12-vk-3 master completed at 2026-09-04 16:45:46+00:00
https://autobuilder.yoctoproject.org/valkyrie/#/builders/30/builds/4549/steps/17/logs/stdio

qemux86-64 debian12-vk-5 master completed at 2026-09-04 16:34:49+00:00
https://autobuilder.yoctoproject.org/valkyrie/#/builders/68/builds/4679/steps/17/logs/stdio

qemuarmv5 debian11-vk-1 master completed at 2026-09-04 15:59:55+00:00
https://autobuilder.yoctoproject.org/valkyrie/#/builders/80/builds/4403/steps/18/logs/stdio

qemux86 alma8-vk-1 mathieu/master-next-tests&amp;mathieu/master-next completed at 2026-09-05 12:39:06+00:00
https://autobuilder.yoctoproject.org/valkyrie/#/builders/30/builds/4561/steps/17/logs/stdio

qemux86 debian12-vk-6 mathieu/master-next-tests&amp;mathieu/master-next completed at 2026-09-05 14:17:19+00:00
https://autobuilder.yoctoproject.org/valkyrie/#/builders/30/builds/4562/steps/16/logs/stdio

qemux86-64 debian13-vk-2 mathieu/master-next-tests&amp;mathieu/master-next completed at 2026-09-05 12:27:23+00:00
https://autobuilder.yoctoproject.org/valkyrie/#/builders/68/builds/4690/steps/16/logs/stdio</thetext>
  </long_desc><long_desc isprivate="0" >
    <commentid>106747</commentid>
    <comment_count>5</comment_count>
    <who name="Mathieu Dubois-Briand">mathieu.dubois-briand</who>
    <bug_when>2026-09-07 08:24:01 +0000</bug_when>
    <thetext>qemux86 ubuntu2510-vk-1 master-next&amp;master completed at 2026-09-04 20:59:37+00:00
https://autobuilder.yoctoproject.org/valkyrie/#/builders/30/builds/4555/steps/17/logs/stdio</thetext>
  </long_desc><long_desc isprivate="0" >
    <commentid>106755</commentid>
    <comment_count>6</comment_count>
    <who name="Richard Purdie">richard.purdie</who>
    <bug_when>2026-09-08 09:22:38 +0000</bug_when>
    <thetext>https://git.openembedded.org/openembedded-core/commit/?id=02890c1eff104de94ad22023232fd36baaf228dc</thetext>
  </long_desc><long_desc isprivate="0" >
    <commentid>106756</commentid>
    <comment_count>7</comment_count>
    <who name="Yoann Congal">yoann.congal</who>
    <bug_when>2026-09-08 09:35:43 +0000</bug_when>
    <thetext>Self note about wrynose:
Looks like the bug was introduced with 
  lib/oe/kernel_module.py: add get_ext_mod function for module signing
  https://git.openembedded.org/openembedded-core/commit/?id=a608d107cca13587cd45be45ddfbc4bfdc228f2c
which I did not backport to wrynose, so It should be safe to upgrade the kernel there.</thetext>
  </long_desc>
      
      

    </bug>

</bugzilla>