<?xml version="1.0" encoding="UTF-8" standalone="yes" ?>
<!DOCTYPE bugzilla SYSTEM "https://bugzilla.yoctoproject.org/page.cgi?id=bugzilla.dtd">

<bugzilla version="5.0.6"
          urlbase="https://bugzilla.yoctoproject.org/"
          
          maintainer="it-coreprojects-helpdesk@linuxfoundation.org"
>

    <bug>
          <bug_id>16416</bug_id>
          
          <creation_ts>2026-09-04 11:56:10 +0000</creation_ts>
          <short_desc>AB-INT: test_python_fatal_loggingA: Timeout while waiting for a reply from the bitbake server</short_desc>
          <delta_ts>2026-09-10 15:54:25 +0000</delta_ts>
          <reporter_accessible>1</reporter_accessible>
          <cclist_accessible>1</cclist_accessible>
          <classification_id>10</classification_id>
          <classification>QA/Testing</classification>
          <product>Functional (self) Testing</product>
          <component>oe-selftest</component>
          <version>unspecified</version>
          <rep_platform>x86</rep_platform>
          <op_sys>Multiple</op_sys>
          <bug_status>NEW</bug_status>
          <resolution></resolution>
          
          
          <bug_file_loc></bug_file_loc>
          <status_whiteboard>AB-INT</status_whiteboard>
          <keywords></keywords>
          <priority>Medium</priority>
          <bug_severity>normal</bug_severity>
          <target_milestone>6.2</target_milestone>
          
          
          <everconfirmed>1</everconfirmed>
          <reporter name="Mathieu Dubois-Briand">mathieu.dubois-briand</reporter>
          <assigned_to name="Unassigned">unassigned</assigned_to>
          <cc>randy.macleod</cc>
    
    <cc>richard.purdie</cc>
          
          
          <cf_os>---</cf_os>
          <cf_regression_type>---</cf_regression_type>
          
          <cf_docchange>No (bug/feature does not impact docs)</cf_docchange>

      

      

      

          <comment_sort_order>oldest_to_newest</comment_sort_order>  
          <long_desc isprivate="0" >
    <commentid>106728</commentid>
    <comment_count>0</comment_count>
    <who name="Mathieu Dubois-Briand">mathieu.dubois-briand</who>
    <bug_when>2026-09-04 11:56:10 +0000</bug_when>
    <thetext>I believe this one is different from the bitbake timeout we had in the past.

2026-09-01 01:31:32,888 - oe-selftest - INFO -  ... FAIL
...
2026-09-01 01:31:32,888 - oe-selftest - INFO - 8: 13/78 91/764 (61.06s) (0 failed) (bblogging.BitBakeLogging.test_python_fatal_loggingA)
2026-09-01 01:31:32,888 - oe-selftest - INFO - testtools.testresult.real._StringException: Traceback (most recent call last):
  File &quot;/srv/pokybuild/yocto-worker/oe-selftest-debian/build/layers/openembedded-core/meta/lib/oeqa/selftest/cases/bblogging.py&quot;, line 154, in test_python_fatal_loggingA
    self.assertIn(&quot;ERROR: Logfile of failure stored in:&quot;, result.output)
    ~~~~~~~~~~~~~^^^^^^^^^^^^^^^^^^^^^^^^^^^^^^^^^^^^^^^^^^^^^^^^^^^^^^^
  File &quot;/usr/lib/python3.13/unittest/case.py&quot;, line 1174, in assertIn
    self.fail(self._formatMessage(msg, standardMsg))
    ~~~~~~~~~^^^^^^^^^^^^^^^^^^^^^^^^^^^^^^^^^^^^^^^
  File &quot;/usr/lib/python3.13/unittest/case.py&quot;, line 732, in fail
    raise self.failureException(msg)
AssertionError: &apos;ERROR: Logfile of failure stored in:&apos; not found in &apos;Timeout while waiting for a reply from the bitbake server (60s at 01:31:32.244941)&apos;</thetext>
  </long_desc><long_desc isprivate="0" >
    <commentid>106729</commentid>
    <comment_count>1</comment_count>
    <who name="Mathieu Dubois-Briand">mathieu.dubois-briand</who>
    <bug_when>2026-09-04 12:03:27 +0000</bug_when>
    <thetext>oe-selftest-debian debian13-vk-2 master completed at 2026-09-01 02:41:15+00:00
https://autobuilder.yoctoproject.org/valkyrie/#/builders/35/builds/4724/steps/17/logs/stdio</thetext>
  </long_desc><long_desc isprivate="0" >
    <commentid>106785</commentid>
    <comment_count>2</comment_count>
    <who name="Randy MacLeod">randy.macleod</who>
    <bug_when>2026-09-10 14:38:35 +0000</bug_when>
    <thetext>Richard looked at the cooker logs.
60 reply missed, reply happened around 90 sec.</thetext>
  </long_desc><long_desc isprivate="0" >
    <commentid>106801</commentid>
    <comment_count>3</comment_count>
    <who name="Richard Purdie">richard.purdie</who>
    <bug_when>2026-09-10 15:54:25 +0000</bug_when>
    <thetext>Cooker logs saved here https://valkyrie.yocto.io/pub/shared-failure-data/debian13-vk-2-selftest/
Server did reply, just took a long time (90s).</thetext>
  </long_desc>
      
      

    </bug>

</bugzilla>