<?xml version="1.0" encoding="UTF-8" standalone="yes" ?>
<!DOCTYPE bugzilla SYSTEM "https://bugzilla.yoctoproject.org/page.cgi?id=bugzilla.dtd">

<bugzilla version="5.0.6"
          urlbase="https://bugzilla.yoctoproject.org/"
          
          maintainer="it-coreprojects-helpdesk@linuxfoundation.org"
>

    <bug>
          <bug_id>16452</bug_id>
          
          <creation_ts>2026-10-15 07:22:30 +0000</creation_ts>
          <short_desc>AB-INT: test_sdk_none_nfs_qemu: lldb connection failed</short_desc>
          <delta_ts>2026-10-15 14:53:37 +0000</delta_ts>
          <reporter_accessible>1</reporter_accessible>
          <cclist_accessible>1</cclist_accessible>
          <classification_id>10</classification_id>
          <classification>QA/Testing</classification>
          <product>Functional (self) Testing</product>
          <component>general</component>
          <version>unspecified</version>
          <rep_platform>x86</rep_platform>
          <op_sys>Multiple</op_sys>
          <bug_status>NEW</bug_status>
          <resolution></resolution>
          
          
          <bug_file_loc></bug_file_loc>
          <status_whiteboard>AB-INT</status_whiteboard>
          <keywords></keywords>
          <priority>Medium+</priority>
          <bug_severity>normal</bug_severity>
          <target_milestone>6.2 M1</target_milestone>
          
          
          <everconfirmed>1</everconfirmed>
          <reporter name="Mathieu Dubois-Briand">mathieu.dubois-briand</reporter>
          <assigned_to name="Adrian Freihofer">adrian.freihofer</assigned_to>
          <cc>randy.macleod</cc>
          
          
          <cf_os>---</cf_os>
          <cf_regression_type>---</cf_regression_type>
          
          <cf_docchange>No (bug/feature does not impact docs)</cf_docchange>

      

      

      

          <comment_sort_order>oldest_to_newest</comment_sort_order>  
          <long_desc isprivate="0" >
    <commentid>107068</commentid>
    <comment_count>0</comment_count>
    <who name="Mathieu Dubois-Briand">mathieu.dubois-briand</who>
    <bug_when>2026-10-15 07:22:30 +0000</bug_when>
    <thetext>Connection to the lldb server timed out during the test:


&gt; 2026-10-14 01:36:43,191 - oe-selftest - INFO - devtool.DevtoolIdeSdkClangTests.test_sdk_none_nfs_qemu (subunit.RemotedTestCase)
&gt; 2026-10-14 01:36:43,192 - oe-selftest - INFO -  ... FAIL
&gt; ...
&gt; 2026-10-14 01:36:43,192 - oe-selftest - INFO - 11: 4/72 347/769 (351.08s) (0 failed) (devtool.DevtoolIdeSdkClangTests.test_sdk_none_nfs_qemu)
&gt; 2026-10-14 01:36:43,192 - oe-selftest - INFO - testtools.testresult.real._StringException: Traceback (most recent call last):
&gt;   File &quot;/srv/pokybuild/yocto-worker/oe-selftest-fedora/build/layers/openembedded-core/meta/lib/oeqa/selftest/cases/devtool.py&quot;, line 5155, in test_sdk_none_nfs_qemu
&gt;     self._test_code_and_none_qemu(nfs=True)
&gt;     ~~~~~~~~~~~~~~~~~~~~~~~~~~~~~^^^^^^^^^^
&gt;   File &quot;/srv/pokybuild/yocto-worker/oe-selftest-fedora/build/layers/openembedded-core/meta/lib/oeqa/selftest/cases/devtool.py&quot;, line 3744, in _test_code_and_none_qemu
&gt;     self._verify_recipe_ide_sdk(
&gt;     ~~~~~~~~~~~~~~~~~~~~~~~~~~~^
&gt;         tempdir_cmake, qemu, self._cmake_recipe_name, self._cmake_recipe_name, compile_cmd)
&gt;         ^^^^^^^^^^^^^^^^^^^^^^^^^^^^^^^^^^^^^^^^^^^^^^^^^^^^^^^^^^^^^^^^^^^^^^^^^^^^^^^^^^^
&gt;   File &quot;/srv/pokybuild/yocto-worker/oe-selftest-fedora/build/layers/openembedded-core/meta/lib/oeqa/selftest/cases/devtool.py&quot;, line 4689, in _verify_recipe_ide_sdk
&gt;     self._lldb_server_debugging_once(
&gt;     ~~~~~~~~~~~~~~~~~~~~~~~~~~~~~~~~^
&gt;         tempdir, qemu, DevtoolIdeSdkTests.MAGIC_STRING_ORIG)
&gt;         ^^^^^^^^^^^^^^^^^^^^^^^^^^^^^^^^^^^^^^^^^^^^^^^^^^^^
&gt;   File &quot;/srv/pokybuild/yocto-worker/oe-selftest-fedora/build/layers/openembedded-core/meta/lib/oeqa/selftest/cases/devtool.py&quot;, line 5053, in _lldb_server_debugging_once
&gt;     r = runCmd(lldb_batch, output_log=self._cmd_logger)
&gt;   File &quot;/srv/pokybuild/yocto-worker/oe-selftest-fedora/build/layers/openembedded-core/meta/lib/oeqa/utils/commands.py&quot;, line 214, in runCmd
&gt;     raise AssertionError(&quot;Command &apos;%s&apos; returned non-zero exit status %d:\n%s&quot; % (command, result.status, exc_output))
&gt; AssertionError: Command &apos;[&apos;/srv/pokybuild/yocto-worker/oe-selftest-fedora/build/build-st-765957/tmp/work/x86_64-linux/lldb-native/23.1.2/recipe-sysroot-native/usr/bin/lldb&apos;, &apos;--batch&apos;, &apos;-o&apos;, &apos;platform select remote-linux&apos;, &apos;-o&apos;, &apos;platform connect connect://192.168.7.2:1234&apos;, &apos;-o&apos;, &apos;settings set target.process.thread.step-avoid-regexp &quot;&quot;&apos;, &apos;-o&apos;, &apos;settings set target.debug-file-search-paths /srv/pokybuild/yocto-worker/oe-selftest-fedora/build/build-st-765957/tmp/work/x86-64-v3-poky-linux/cmake-example-clang/1.0/image/usr/lib /srv/pokybuild/yocto-worker/oe-selftest-fedora/build/build-st-765957/tmp/work/x86-64-v3-poky-linux/cmake-example-clang/1.0/image/usr/bin /srv/pokybuild/yocto-worker/oe-selftest-fedora/build/build-st-765957/workspace/nfs-exports/oe-selftest-image/rootfs-dbg/lib/.debug /srv/pokybuild/yocto-worker/oe-selftest-fedora/build/build-st-765957/workspace/nfs-exports/oe-selftest-image/rootfs-dbg/usr/lib/.debug /srv/pokybuild/yocto-worker/oe-selftest-fedora/build/build-st-765957/workspace/nfs-exports/oe-selftest-image/rootfs-dbg/usr/lib/debug /srv/pokybuild/yocto-worker/oe-selftest-fedora/build/build-st-765957/workspace/nfs-exports/oe-selftest-image/rootfs-dbg/lib /srv/pokybuild/yocto-worker/oe-selftest-fedora/build/build-st-765957/workspace/nfs-exports/oe-selftest-image/rootfs-dbg/usr/lib /srv/pokybuild/yocto-worker/oe-selftest-fedora/build/build-st-765957/tmp/work/qemux86_64-poky-linux/oe-selftest-image/1.0/rootfs/lib /srv/pokybuild/yocto-worker/oe-selftest-fedora/build/build-st-765957/tmp/work/qemux86_64-poky-linux/oe-selftest-image/1.0/rootfs/usr/lib&apos;, &apos;-o&apos;, &apos;settings set target.exec-search-paths /srv/pokybuild/yocto-worker/oe-selftest-fedora/build/build-st-765957/tmp/work/x86-64-v3-poky-linux/cmake-example-clang/1.0/image/usr/lib /srv/pokybuild/yocto-worker/oe-selftest-fedora/build/build-st-765957/tmp/work/x86-64-v3-poky-linux/cmake-example-clang/1.0/image/lib /srv/pokybuild/yocto-worker/oe-selftest-fedora/build/build-st-765957/tmp/work/x86-64-v3-poky-linux/cmake-example-clang/1.0/image/usr/bin&apos;, &apos;-o&apos;, &apos;target create --remote-file /usr/bin/cmake-example-clang /srv/pokybuild/yocto-worker/oe-selftest-fedora/build/build-st-765957/tmp/work/x86-64-v3-poky-linux/cmake-example-clang/1.0/image/usr/bin/cmake-example-clang&apos;, &apos;-o&apos;, &apos;settings set target.source-map /usr/include /srv/pokybuild/yocto-worker/oe-selftest-fedora/build/build-st-765957/tmp/work/x86-64-v3-poky-linux/cmake-example-clang/1.0/recipe-sysroot/usr/include /usr/src/debug/cmake-example-clang/1.0 /tmp/devtoolqayjacpldd /usr/src/debug /srv/pokybuild/yocto-worker/oe-selftest-fedora/build/build-st-765957/workspace/nfs-exports/oe-selftest-image/rootfs-dbg/usr/src/debug&apos;, &apos;-o&apos;, &apos;breakpoint set --file cpp-example.cpp --line 114&apos;, &apos;-o&apos;, &apos;breakpoint set --file cpp-example-lib.cpp --line 31&apos;, &apos;-o&apos;, &apos;breakpoint set --file cpp-example-lib.hpp --line 24&apos;, &apos;-o&apos;, &apos;breakpoint list&apos;, &apos;-o&apos;, &apos;run&apos;, &apos;-o&apos;, &apos;p cpp_example.get_string()&apos;, &apos;-o&apos;, &apos;continue&apos;, &apos;-o&apos;, &apos;p flag&apos;, &apos;-o&apos;, &apos;continue&apos;, &apos;-o&apos;, &apos;p n&apos;, &apos;-o&apos;, &apos;continue&apos;, &apos;-o&apos;, &apos;exit&apos;]&apos; returned non-zero exit status 1:
&gt; (lldb) platform select remote-linux
&gt;   Platform: remote-linux
&gt;  Connected: no
&gt; (lldb) platform connect connect://192.168.7.2:1234
&gt; error: failed to get reply to handshake packet within timeout of 6.0 seconds</thetext>
  </long_desc><long_desc isprivate="0" >
    <commentid>107069</commentid>
    <comment_count>1</comment_count>
    <who name="Mathieu Dubois-Briand">mathieu.dubois-briand</who>
    <bug_when>2026-10-15 07:23:18 +0000</bug_when>
    <thetext>oe-selftest-fedora alma8-vk-1 master completed at 2026-10-14 02:45:15+00:00
https://autobuilder.yoctoproject.org/valkyrie/#/builders/48/builds/4867/steps/18/logs/stdio</thetext>
  </long_desc>
      
      

    </bug>

</bugzilla>