<?xml version="1.0" encoding="UTF-8" standalone="yes" ?>
<!DOCTYPE bugzilla SYSTEM "https://bugzilla.yoctoproject.org/page.cgi?id=bugzilla.dtd">

<bugzilla version="5.0.6"
          urlbase="https://bugzilla.yoctoproject.org/"
          
          maintainer="it-coreprojects-helpdesk@linuxfoundation.org"
>

    <bug>
          <bug_id>1696</bug_id>
          
          <creation_ts>2011-10-24 21:17:06 +0000</creation_ts>
          <short_desc>[BSP build] gcc-runtime do_compile failed due to lack of debug_fn_imps.hpp</short_desc>
          <delta_ts>2011-12-15 09:08:09 +0000</delta_ts>
          <reporter_accessible>1</reporter_accessible>
          <cclist_accessible>1</cclist_accessible>
          <classification_id>7</classification_id>
          <classification>Build System, Metadata &amp; Runtime</classification>
          <product>OE-Core</product>
          <component>devtools / tool chain</component>
          <version>unspecified</version>
          <rep_platform>x86</rep_platform>
          <op_sys>Multiple</op_sys>
          <bug_status>RESOLVED</bug_status>
          <resolution>WORKSFORME</resolution>
          
          
          <bug_file_loc></bug_file_loc>
          <status_whiteboard></status_whiteboard>
          <keywords></keywords>
          <priority>Medium</priority>
          <bug_severity>major</bug_severity>
          <target_milestone>1.2</target_milestone>
          
          
          <everconfirmed>1</everconfirmed>
          <reporter name="wenhua.fan">wenhuax.fan</reporter>
          <assigned_to name="Nitin Kamble">nitin.a.kamble</assigned_to>
          <cc>jiajun.xu</cc>
    
    <cc>meta.mr.watcher</cc>
    
    <cc>meta.watcher</cc>
    
    <cc>poky.bs.watcher</cc>
    
    <cc>poky.watcher</cc>
    
    <cc>shane.wang</cc>
    
    <cc>yi.zhao</cc>
          
          
          <cf_os>---</cf_os>
          <cf_regression_type>---</cf_regression_type>
          
          <cf_docchange>---</cf_docchange>

      

      

      

          <comment_sort_order>oldest_to_newest</comment_sort_order>  
          <long_desc isprivate="0" >
    <commentid>16968</commentid>
    <comment_count>0</comment_count>
    <who name="wenhua.fan">wenhuax.fan</who>
    <bug_when>2011-10-24 21:17:06 +0000</bug_when>
    <thetext>With Yocto 1.2 build on autobuilder, the sato and lsb images build failed, the
commit information as below:

Tree/Branch: Poky-contrib/Master_under_test
Commit id: 93edf86374572879159263ed2e71cd06ab266a10

Part of error information is as below:
########
/srv/home/pokybuild/yocto-autobuilder/yocto-lave/n450/build/build/tmp/work/core2-poky-linux/gcc-runtime-4.6.1+svnr178924-r14/gcc-4_6-branch/build.i586-poky-linux.i586-poky-linux/libstdc++-v3/include/ext/pb_ds/detail/bin_search_tree_/bin_search_tree_.hpp:469:63: fatal error: ext/pb_ds/detail/bin_search_tree_/debug_fn_imps.hpp: No such file or directory
########

The details could be found at http://autobuilder.yoctoproject.org:8010/builders/n450/builds/21/steps/shell_15/logs/stdio</thetext>
  </long_desc><long_desc isprivate="0" >
    <commentid>17042</commentid>
    <comment_count>1</comment_count>
    <who name="wenhua.fan">wenhuax.fan</who>
    <bug_when>2011-11-02 00:05:37 +0000</bug_when>
    <thetext>This issue reproduce on autobuilder for Yocto 1.2 20111101 building which cause Jasperforest and Crownbay sato/lsb images build failed. The commit information as below:

Tree/Branch: Poky-contrib/Master_under_test
Commit id: 3287666339088a6a01bcb5890a47863d7f5608b7
Meta branch: Master
Commit id: 63253211b4ca30c3a5fa2b4dd9a393247217816e

Detail log information could be found at:
Jasperforest:
http://autobuilder.yoctoproject.org:8010/builders/jasperforest/builds/20/steps/shell_14/logs/stdio
Crownbay:
http://autobuilder.yoctoproject.org:8010/builders/crownbay/builds/23/steps/shell_14/logs/stdio</thetext>
  </long_desc><long_desc isprivate="0" >
    <commentid>17062</commentid>
    <comment_count>2</comment_count>
    <who name="Jiajun Xu">jiajun.xu</who>
    <bug_when>2011-11-02 23:32:05 +0000</bug_when>
    <thetext>Change the title

On latest autobuilder, such error happen with jasperforest and crownbay build, which cause them build failed.
The commit information:
MACHINE: jasperforest/crownbay:
poky/branch:stage/master_under_test:3287666339088a6a01bcb5890a47863d7f5608b7
meta-intel: master:63253211b4ca30c3a5fa2b4dd9a393247217816e

As an example, you could find jasperforest log on http://autobuilder.pokylinux.org:8010/builders/jasperforest/builds/20/steps/shell_14/logs/stdio.

Detailed log as below:
########
| mkdir -p ./x86_64-poky-linux/bits/stdc++.h.gch
| x86_64-poky-linux-g++    -m64 --sysroot=/srv/home/pokybuild/yocto-autobuilder/yocto-slave/jasperforest/build/build/tmp/sysroots/jasperforest -nostdinc++ -nostdlib++ -x c++-header -nostdinc++ -O2 -pipe -g -feliminate-unused-debug-types -fpermissive -I/srv/home/pokybuild/yocto-autobuilder/yocto-slave/jasperforest/build/build/tmp/work/x86_64-poky-linux/gcc-runtime-4.6.1+svnr180099-r16/gcc-4_6-branch/build.x86_64-poky-linux.x86_64-poky-linux/libstdc++-v3/include/x86_64-poky-linux -I/srv/home/pokybuild/yocto-autobuilder/yocto-slave/jasperforest/build/build/tmp/work/x86_64-poky-linux/gcc-runtime-4.6.1+svnr180099-r16/gcc-4_6-branch/build.x86_64-poky-linux.x86_64-poky-linux/libstdc++-v3/include -I/srv/home/pokybuild/yocto-autobuilder/yocto-slave/jasperforest/build/build/tmp/work-shared/gcc-4.6.1+svnr180099-r16/gcc-4_6-branch/libstdc++-v3/libsupc++ -O2 -g -std=gnu++0x /srv/home/pokybuild/yocto-autobuilder/yocto-slave/jasperforest/build/build/tmp/work-shared/gcc-4.6.1+svnr180099-r16/gcc-4_6-branch/libstdc++-v3/include/precompiled/stdc++.h \
| -o x86_64-poky-linux/bits/stdc++.h.gch/O2ggnu++0x.gch
| x86_64-poky-linux-g++    -m64 --sysroot=/srv/home/pokybuild/yocto-autobuilder/yocto-slave/jasperforest/build/build/tmp/sysroots/jasperforest -nostdinc++ -nostdlib++ -x c++-header -nostdinc++ -O2 -pipe -g -feliminate-unused-debug-types -fpermissive -I/srv/home/pokybuild/yocto-autobuilder/yocto-slave/jasperforest/build/build/tmp/work/x86_64-poky-linux/gcc-runtime-4.6.1+svnr180099-r16/gcc-4_6-branch/build.x86_64-poky-linux.x86_64-poky-linux/libstdc++-v3/include/x86_64-poky-linux -I/srv/home/pokybuild/yocto-autobuilder/yocto-slave/jasperforest/build/build/tmp/work/x86_64-poky-linux/gcc-runtime-4.6.1+svnr180099-r16/gcc-4_6-branch/build.x86_64-poky-linux.x86_64-poky-linux/libstdc++-v3/include -I/srv/home/pokybuild/yocto-autobuilder/yocto-slave/jasperforest/build/build/tmp/work-shared/gcc-4.6.1+svnr180099-r16/gcc-4_6-branch/libstdc++-v3/libsupc++ -O2 -g /srv/home/pokybuild/yocto-autobuilder/yocto-slave/jasperforest/build/build/tmp/work-shared/gcc-4.6.1+svnr180099-r16/gcc-4_6-branch/libstdc++-v3/include/precompiled/stdc++.h -o x86_64-poky-linux/bits/stdc++.h.gch/O2g.gch
| mkdir -p ./x86_64-poky-linux/bits/stdtr1c++.h.gch
| x86_64-poky-linux-g++    -m64 --sysroot=/srv/home/pokybuild/yocto-autobuilder/yocto-slave/jasperforest/build/build/tmp/sysroots/jasperforest -nostdinc++ -nostdlib++ -x c++-header -nostdinc++ -O2 -pipe -g -feliminate-unused-debug-types -fpermissive -I/srv/home/pokybuild/yocto-autobuilder/yocto-slave/jasperforest/build/build/tmp/work/x86_64-poky-linux/gcc-runtime-4.6.1+svnr180099-r16/gcc-4_6-branch/build.x86_64-poky-linux.x86_64-poky-linux/libstdc++-v3/include/x86_64-poky-linux -I/srv/home/pokybuild/yocto-autobuilder/yocto-slave/jasperforest/build/build/tmp/work/x86_64-poky-linux/gcc-runtime-4.6.1+svnr180099-r16/gcc-4_6-branch/build.x86_64-poky-linux.x86_64-poky-linux/libstdc++-v3/include -I/srv/home/pokybuild/yocto-autobuilder/yocto-slave/jasperforest/build/build/tmp/work-shared/gcc-4.6.1+svnr180099-r16/gcc-4_6-branch/libstdc++-v3/libsupc++ -O2 -g /srv/home/pokybuild/yocto-autobuilder/yocto-slave/jasperforest/build/build/tmp/work-shared/gcc-4.6.1+svnr180099-r16/gcc-4_6-branch/libstdc++-v3/include/precompiled/stdtr1c++.h -o x86_64-poky-linux/bits/stdtr1c++.h.gch/O2g.gch
| mkdir -p ./x86_64-poky-linux/bits/extc++.h.gch
| x86_64-poky-linux-g++    -m64 --sysroot=/srv/home/pokybuild/yocto-autobuilder/yocto-slave/jasperforest/build/build/tmp/sysroots/jasperforest -nostdinc++ -nostdlib++ -x c++-header -nostdinc++ -O2 -pipe -g -feliminate-unused-debug-types -fpermissive -I/srv/home/pokybuild/yocto-autobuilder/yocto-slave/jasperforest/build/build/tmp/work/x86_64-poky-linux/gcc-runtime-4.6.1+svnr180099-r16/gcc-4_6-branch/build.x86_64-poky-linux.x86_64-poky-linux/libstdc++-v3/include/x86_64-poky-linux -I/srv/home/pokybuild/yocto-autobuilder/yocto-slave/jasperforest/build/build/tmp/work/x86_64-poky-linux/gcc-runtime-4.6.1+svnr180099-r16/gcc-4_6-branch/build.x86_64-poky-linux.x86_64-poky-linux/libstdc++-v3/include -I/srv/home/pokybuild/yocto-autobuilder/yocto-slave/jasperforest/build/build/tmp/work-shared/gcc-4.6.1+svnr180099-r16/gcc-4_6-branch/libstdc++-v3/libsupc++ -O2 -g /srv/home/pokybuild/yocto-autobuilder/yocto-slave/jasperforest/build/build/tmp/work-shared/gcc-4.6.1+svnr180099-r16/gcc-4_6-branch/libstdc++-v3/include/precompiled/extc++.h -o x86_64-poky-linux/bits/extc++.h.gch/O2g.gch
| In file included from /srv/home/pokybuild/yocto-autobuilder/yocto-slave/jasperforest/build/build/tmp/work/x86_64-poky-linux/gcc-runtime-4.6.1+svnr180099-r16/gcc-4_6-branch/build.x86_64-poky-linux.x86_64-poky-linux/libstdc++-v3/include/ext/pb_ds/detail/rb_tree_map_/rb_tree_.hpp:48:0,
|                  from /srv/home/pokybuild/yocto-autobuilder/yocto-slave/jasperforest/build/build/tmp/work/x86_64-poky-linux/gcc-runtime-4.6.1+svnr180099-r16/gcc-4_6-branch/build.x86_64-poky-linux.x86_64-poky-linux/libstdc++-v3/include/ext/pb_ds/detail/container_base_dispatch.hpp:55,
|                  from /srv/home/pokybuild/yocto-autobuilder/yocto-slave/jasperforest/build/build/tmp/work/x86_64-poky-linux/gcc-runtime-4.6.1+svnr180099-r16/gcc-4_6-branch/build.x86_64-poky-linux.x86_64-poky-linux/libstdc++-v3/include/ext/pb_ds/assoc_container.hpp:48,
|                  from /srv/home/pokybuild/yocto-autobuilder/yocto-slave/jasperforest/build/build/tmp/work-shared/gcc-4.6.1+svnr180099-r16/gcc-4_6-branch/libstdc++-v3/include/precompiled/extc++.h:60:
| /srv/home/pokybuild/yocto-autobuilder/yocto-slave/jasperforest/build/build/tmp/work/x86_64-poky-linux/gcc-runtime-4.6.1+svnr180099-r16/gcc-4_6-branch/build.x86_64-poky-linux.x86_64-poky-linux/libstdc++-v3/include/ext/pb_ds/detail/bin_search_tree_/bin_search_tree_.hpp:469:63: fatal error: ext/pb_ds/detaERROR: Function &apos;do_compile&apos; failed (see /srv/home/pokybuild/yocto-autobuilder/yocto-slave/jasperforest/build/build/tmp/work/x86_64-poky-linux/gcc-runtime-4.6.1+svnr180099-r16/temp/log.do_compile.5559 for further information)
| il/bin_search_tree_/debug_fn_imps.hpp: No such file or directory
| compilation terminated.
| make[2]: *** [x86_64-poky-linux/bits/extc++.h.gch/O2g.gch] Error 1
| make[2]: Leaving directory `/srv/home/pokybuild/yocto-autobuilder/yocto-slave/jasperforest/build/build/tmp/work/x86_64-poky-linux/gcc-runtime-4.6.1+svnr180099-r16/gcc-4_6-branch/build.x86_64-poky-linux.x86_64-poky-linux/libstdc++-v3/include&apos;
| make[1]: *** [all-recursive] Error 1
| make[1]: Leaving directory `/srv/home/pokybuild/yocto-autobuilder/yocto-slave/jasperforest/build/build/tmp/work/x86_64-poky-linux/gcc-runtime-4.6.1+svnr180099-r16/gcc-4_6-branch/build.x86_64-poky-linux.x86_64-poky-linux/libstdc++-v3&apos;
| make: *** [all] Error 2
| ERROR: oe_runmake failed
NOTE: package gcc-runtime-4.6.1+svnr180099-r16: task do_compile: Failed
########</thetext>
  </long_desc><long_desc isprivate="0" >
    <commentid>17434</commentid>
    <comment_count>3</comment_count>
    <who name="Nitin Kamble">nitin.a.kamble</who>
    <bug_when>2011-11-30 10:21:32 +0000</bug_when>
    <thetext>please provide steps to reproduce the issue.</thetext>
  </long_desc><long_desc isprivate="0" >
    <commentid>17495</commentid>
    <comment_count>4</comment_count>
    <who name="Jiajun Xu">jiajun.xu</who>
    <bug_when>2011-12-05 07:10:59 +0000</bug_when>
    <thetext>(In reply to comment #3)
&gt; please provide steps to reproduce the issue.

Same as bug 1720, I reported the bug since autobuilder build is blocked by the issue. I will check if next round BSP build will meet the same issue on autobuilder.</thetext>
  </long_desc><long_desc isprivate="0" >
    <commentid>17663</commentid>
    <comment_count>5</comment_count>
    <who name="Nitin Kamble">nitin.a.kamble</who>
    <bug_when>2011-12-15 09:08:09 +0000</bug_when>
    <thetext>It looks as if these bugs are resolved, possibly due to stabilization of Shared State.  Since the builds are now working on the Autobuilder and that was where these failures where occurring, I think we can close them.</thetext>
  </long_desc>
      
      

    </bug>

</bugzilla>