<?xml version="1.0" encoding="UTF-8" standalone="yes" ?>
<!DOCTYPE bugzilla SYSTEM "https://bugzilla.yoctoproject.org/page.cgi?id=bugzilla.dtd">

<bugzilla version="5.0.6"
          urlbase="https://bugzilla.yoctoproject.org/"
          
          maintainer="it-coreprojects-helpdesk@linuxfoundation.org"
>

    <bug>
          <bug_id>1725</bug_id>
          
          <creation_ts>2011-11-03 00:33:29 +0000</creation_ts>
          <short_desc>pulseaudio do_install failed for atom-pc on autobuilder</short_desc>
          <delta_ts>2011-11-21 21:31:41 +0000</delta_ts>
          <reporter_accessible>1</reporter_accessible>
          <cclist_accessible>1</cclist_accessible>
          <classification_id>7</classification_id>
          <classification>Build System, Metadata &amp; Runtime</classification>
          <product>OE-Core</product>
          <component>multimedia</component>
          <version>unspecified</version>
          <rep_platform>x86</rep_platform>
          <op_sys>Multiple</op_sys>
          <bug_status>RESOLVED</bug_status>
          <resolution>DUPLICATE</resolution>
          <dup_id>1722</dup_id>
          
          <bug_file_loc></bug_file_loc>
          <status_whiteboard></status_whiteboard>
          <keywords></keywords>
          <priority>Medium</priority>
          <bug_severity>major</bug_severity>
          <target_milestone>1.2</target_milestone>
          
          
          <everconfirmed>1</everconfirmed>
          <reporter name="Jiajun Xu">jiajun.xu</reporter>
          <assigned_to name="Dongxiao Xu">dongxiao.xu</assigned_to>
          <cc>ke.yu</cc>
    
    <cc>meta.mr.watcher</cc>
    
    <cc>meta.watcher</cc>
    
    <cc>sgw</cc>
          
          
          <cf_os>---</cf_os>
          <cf_regression_type>---</cf_regression_type>
          
          <cf_docchange>---</cf_docchange>

      

      

      

          <comment_sort_order>oldest_to_newest</comment_sort_order>  
          <long_desc isprivate="0" >
    <commentid>17067</commentid>
    <comment_count>0</comment_count>
    <who name="Jiajun Xu">jiajun.xu</who>
    <bug_when>2011-11-03 00:33:29 +0000</bug_when>
    <thetext>MACHINE: atom-pc
poky/branch:master 9b76e6a2cfc5a4d779f3b06e3acc5ff7b8275470

On autobuilder, latest atom-pc sato/sato-sdk build failed due to pulseaudio do_install error. Error log as below:

You could find detailed log on http://autobuilder.pokylinux.org:8010/builders/nightly-x86/builds/204/steps/shell_28/logs/stdio.

#####
| ild/tmp/sysroots/atom-pc/usr/lib/libXau.la&apos; seems to be moved
| i586-poky-linux-libtool: relink: warning: `/srv/home/pokybuild/yocto-autobuilder/yocto-slave/nightly-x86/build/build/tmp/sysroots/atom-pc/usr/lib/libXdmcp.la&apos; seems to be moved
| i586-poky-linux-libtool: relink: warning: `/srv/home/pokybuild/yocto-autobuilder/yocto-slave/nightly-x86/build/build/tmp/sysroots/atom-pc/usr/lib/libXau.la&apos; seems to be moved
| i586-poky-linux-libtool: relink: warning: `/srv/home/pokybuild/yocto-autobuilder/yocto-slave/nightly-x86/build/build/tmp/sysroots/atom-pc/usr/lib/libXdmcp.la&apos; seems to be moved
| i586-poky-linux-libtool: relink: ccache i586-poky-linux-gcc  -m32    -march=core2 -msse3 -mtune=generic -mfpmath=sse --sysroot=/srv/home/pokybuild/yocto-autobuilder/yocto-slave/nightly-x86/build/build/tmp/sysroots/atom-pc -std=gnu99 -shared  -fPIC -DPIC  .libs/module_zeroconf_publish_la-module-zeroconf-publish.o   -Wl,-rpath -Wl,/usr/lib/pulse-0.9.23/modules -L/srv/home/pokybuild/yocto-autobuilder/yocto-slave/nightly-x86/build/build/tmp/work/core2-poky-linux/pulseaudio-0.9.23-r6/pulseaudio-0.9.23/src/.libs -lavahi-common -lavahi-client -L/srv/home/pokybuild/yocto-autobuilder/yocto-slave/nightly-x86/build/build/tmp/work/core2-poky-linux/pulseaudio-0.9.23-r6/image/usr/lib/pulse-0.9.23/modules -L/srv/home/pokybuild/yocto-autobuilder/yocto-slave/nightly-x86/build/build/tmp/sysroots/atom-pc/usr/lib/pulse-0.9.23/modules -lavahi-wrap -L/srv/home/pokybuild/yocto-autobuilder/yocto-slave/nightly-x86/build/build/tmp/sysroots/atom-pc/usr/lib -lprotocol-native -L/srv/home/pokybuild/yocto-autobuilder/yocto-slave/nightly-x86/build/build/tmp/work/core2-poky-linux/pulseaudio-0.9.23-r6/image/usr/lib -lpulsecore-0.9.23 -lltdl -lsamplerate -lspeexdsp -lpulse -lpulsecommon-0.9.23 -lX11-xcb -lSM -luuid -lICE -lXtst -lXi -lXext -lX11 -lxcb -lXau -lXdmcp -lsndfile -ldbus-1 -lpthread -lgdbm -lcap -lrt -ldl -lm  -m32 -march=core2 -msse3 -mtune=generic -mfpmath=sse --sysroot=/srv/home/pokybuild/yocto-autobuilder/yocto-slave/nightly-x86/build/build/tmp/sysroots/atom-pc -pthread -O2 -Wl,--no-undefined -Wl,-O1 -Wl,--hash-style=gnu   -pthread -Wl,-soname -Wl,module-zeroconf-publish.so -o .libs/module-zeroconf-publish.so
| /srv/home/pokybuild/yocto-autobuilder/yocto-slave/nightly-x86/build/build/tmp/sysroots/x86_64-linux/usr/libexec/core2-poky-linux/gcc/i586-poky-linux/4.6.2/ld: cannot find -lavahi-common
| /srv/home/pokybuild/yocto-autobuilder/yocto-slave/nightly-x86/build/build/tmp/sysroots/x86_64-linux/usr/libexec/core2-poky-linux/gcc/i586-poky-linux/4.6.2/ld: cannot find -lavahi-client
| collect2: ld returned 1 exit status
| i586-poky-linux-libtool: install: error: relink `module-zeroconf-publish.la&apos; with the above command before installing it
| make[5]: *** [install-modlibexecLTLIBRARIES] Error 1
| make[5]: Leaving directory `/srv/home/pokybuild/yocto-autobuilder/yocto-slave/nightly-x86/build/build/tmp/work/core2-poky-linux/pulseaudio-0.9.23-r6/pulseaudio-0.9.23/src&apos;
| make[4]: *** [install-am] Error 2
| make[4]: Leaving directory `/srv/home/pokybuild/yocto-autobuilder/yocto-slave/nightly-x86/build/build/tmp/work/core2-poky-linux/pulseaudio-0.9.23-r6/pulseaudio-0.9.23/src&apos;
| make[3]: *** [install-recursive] Error 1
| make[3]: Leaving directory `/srv/home/pokybuild/yocto-autobuilder/yocto-slave/nightly-x86/build/build/tmp/work/core2-poky-linux/pulseaudio-0.9.23-r6/pulseaudio-0.9.23/src&apos;
| make[2]: *** [install] Error 2
| make[2]: Leaving directory `/srv/home/pokybuild/yocto-autobuilder/yocto-slave/nightly-x86/build/build/tmp/work/core2-poky-linux/pulseaudio-0.9.23-r6/pulseaudio-0.9.23/src&apos;
| make[1]: *** [install-recursive] Error 1
| make[1]: Leaving directory `/srv/home/pokybuild/yocto-autobuilder/yocto-slave/nightly-x86/build/build/tmp/work/core2-poky-linux/pulseaudio-0.9.23-r6/pulseaudio-0.9.23&apos;
| make: *** [install] Error 2
| ERROR: oe_runmake failed
#####</thetext>
  </long_desc><long_desc isprivate="0" >
    <commentid>17074</commentid>
    <comment_count>1</comment_count>
    <who name="Saul Wold">sgw</who>
    <bug_when>2011-11-03 15:13:39 +0000</bug_when>
    <thetext>Duplicate, this seems to be an issue with avahi-common dependency.

*** This bug has been marked as a duplicate of bug 1722 ***</thetext>
  </long_desc><long_desc isprivate="0" >
    <commentid>17308</commentid>
    <comment_count>2</comment_count>
    <who name="Jiajun Xu">jiajun.xu</who>
    <bug_when>2011-11-21 21:31:41 +0000</bug_when>
    <thetext>I do not notice such issue with 20111117 build, commit information: poky/master, f2d077255d9ddf9b87e9a781b989bcce69047cf5</thetext>
  </long_desc>
      
      

    </bug>

</bugzilla>