<?xml version="1.0" encoding="UTF-8" standalone="yes" ?>
<!DOCTYPE bugzilla SYSTEM "https://bugzilla.yoctoproject.org/page.cgi?id=bugzilla.dtd">

<bugzilla version="5.0.6"
          urlbase="https://bugzilla.yoctoproject.org/"
          
          maintainer="it-coreprojects-helpdesk@linuxfoundation.org"
>

    <bug>
          <bug_id>1944</bug_id>
          
          <creation_ts>2012-01-31 13:36:26 +0000</creation_ts>
          <short_desc>FR2 build failure on autobuilder relating to gcc -E preprocess sanity test</short_desc>
          <delta_ts>2012-02-01 08:53:54 +0000</delta_ts>
          <reporter_accessible>1</reporter_accessible>
          <cclist_accessible>1</cclist_accessible>
          <classification_id>7</classification_id>
          <classification>Build System, Metadata &amp; Runtime</classification>
          <product>OE-Core</product>
          <component>devtools / tool chain</component>
          <version>unspecified</version>
          <rep_platform>x86</rep_platform>
          <op_sys>Multiple</op_sys>
          <bug_status>RESOLVED</bug_status>
          <resolution>NOTABUG</resolution>
          
          
          <bug_file_loc></bug_file_loc>
          <status_whiteboard></status_whiteboard>
          <keywords></keywords>
          <priority>Medium</priority>
          <bug_severity>normal</bug_severity>
          <target_milestone>---</target_milestone>
          
          
          <everconfirmed>1</everconfirmed>
          <reporter name="Jessica">jessica.zhang</reporter>
          <assigned_to name="Nitin Kamble">nitin.a.kamble</assigned_to>
          <cc>elizabeth.flanagan</cc>
    
    <cc>meta.mr.watcher</cc>
    
    <cc>meta.watcher</cc>
    
    <cc>sgw</cc>
          
          
          <cf_os>---</cf_os>
          <cf_regression_type>---</cf_regression_type>
          
          <cf_docchange>---</cf_docchange>

      

      

      

          <comment_sort_order>oldest_to_newest</comment_sort_order>  
          <long_desc isprivate="0" >
    <commentid>18438</commentid>
    <comment_count>0</comment_count>
    <who name="Jessica">jessica.zhang</who>
    <bug_when>2012-01-31 13:36:26 +0000</bug_when>
    <thetext>logs info:

checking whether /srv/home/pokybuild/yocto-autobuilder/yocto-slave/fri2-noemgd/build/build/tmp/work/core2-poky-linux/gcc-cross-initial-4.6.2+svnr181430-r22/gcc-4_6-branch/build.x86_64-linux.i586-poky-linux/./gcc/xgcc -B/srv/home/pokybuild/yocto-autobuilder/yocto-slave/fri2-noemgd/build/build/tmp/work/core2-poky-linux/gcc-cross-initial-4.6.2+svnr181430-r22/gcc-4_6-branch/build.x86_64-linux.i586-poky-linux/./gcc/ -m32    -march=core2 -msse3 -mtune=generic -mfpmath=sse -isystem/srv/hERROR: Function failed: do_compile (see /srv/home/pokybuild/yocto-autobuilder/yocto-slave/fri2-noemgd/build/build/tmp/work/core2-poky-linux/gcc-cross-initial-4.6.2+svnr181430-r22/temp/log.do_compile.27197 for further information)
| ome/pokybuild/yocto-autobuilder/yocto-slave/fri2-noemgd/build/build/tmp/sysroots/fri2-noemgd/usr/include -B/srv/home/pokybuild/yocto-autobuilder/yocto-slave/fri2-noemgd/build/build/tmp/sysroots/x86_64-linux/usr/i586-poky-linux/bin/ -B/srv/home/pokybuild/yocto-autobuilder/yocto-slave/fri2-noemgd/build/build/tmp/sysroots/x86_64-linux/usr/i586-poky-linux/lib/ -isystem /srv/home/pokybuild/yocto-autobuilder/yocto-slave/fri2-noemgd/build/build/tmp/sysroots/x86_64-linux/usr/i586-poky-linux/include -isystem /srv/home/pokybuild/yocto-autobuilder/yocto-slave/fri2-noemgd/build/build/tmp/sysroots/x86_64-linux/usr/i586-poky-linux/sys-include --sysroot=/srv/home/pokybuild/yocto-autobuilder/yocto-slave/fri2-noemgd/build/build/tmp/sysroots/fri2-noemgd   accepts -g... yes
| checking for /srv/home/pokybuild/yocto-autobuilder/yocto-slave/fri2-noemgd/build/build/tmp/work/core2-poky-linux/gcc-cross-initial-4.6.2+svnr181430-r22/gcc-4_6-branch/build.x86_64-linux.i586-poky-linux/./gcc/xgcc -B/srv/home/pokybuild/yocto-autobuilder/yocto-slave/fri2-noemgd/build/build/tmp/work/core2-poky-linux/gcc-cross-initial-4.6.2+svnr181430-r22/gcc-4_6-branch/build.x86_64-linux.i586-poky-linux/./gcc/ -m32    -march=core2 -msse3 -mtune=generic -mfpmath=sse -isystem/srv/home/pokybuild/yocto-autobuilder/yocto-slave/fri2-noemgd/build/build/tmp/sysroots/fri2-noemgd/usr/include -B/srv/home/pokybuild/yocto-autobuilder/yocto-slave/fri2-noemgd/build/build/tmp/sysroots/x86_64-linux/usr/i586-poky-linux/bin/ -B/srv/home/pokybuild/yocto-autobuilder/yocto-slave/fri2-noemgd/build/build/tmp/sysroots/x86_64-linux/usr/i586-poky-linux/lib/ -isystem /srv/home/pokybuild/yocto-autobuilder/yocto-slave/fri2-noemgd/build/build/tmp/sysroots/x86_64-linux/usr/i586-poky-linux/include -isystem /srv/home/pokybuild/yocto-autobuilder/yocto-slave/fri2-noemgd/build/build/tmp/sysroots/x86_64-linux/usr/i586-poky-linux/sys-include --sysroot=/srv/home/pokybuild/yocto-autobuilder/yocto-slave/fri2-noemgd/build/build/tmp/sysroots/fri2-noemgd   option to accept ISO C89... none needed
| checking how to run the C preprocessor... /srv/home/pokybuild/yocto-autobuilder/yocto-slave/fri2-noemgd/build/build/tmp/work/core2-poky-linux/gcc-cross-initial-4.6.2+svnr181430-r22/gcc-4_6-branch/build.x86_64-linux.i586-poky-linux/./gcc/xgcc -B/srv/home/pokybuild/yocto-autobuilder/yocto-slave/fri2-noemgd/build/build/tmp/work/core2-poky-linux/gcc-cross-initial-4.6.2+svnr181430-r22/gcc-4_6-branch/build.x86_64-linux.i586-poky-linux/./gcc/ -E
| configure: error: in `/srv/home/pokybuild/yocto-autobuilder/yocto-slave/fri2-noemgd/build/build/tmp/work/core2-poky-linux/gcc-cross-initial-4.6.2+svnr181430-r22/gcc-4_6-branch/build.x86_64-linux.i586-poky-linux/i586-poky-linux/libgcc&apos;:
| configure: error: C preprocessor &quot;/srv/home/pokybuild/yocto-autobuilder/yocto-slave/fri2-noemgd/build/build/tmp/work/core2-poky-linux/gcc-cross-initial-4.6.2+svnr181430-r22/gcc-4_6-branch/build.x86_64-linux.i586-poky-linux/./gcc/xgcc -B/srv/home/pokybuild/yocto-autobuilder/yocto-slave/fri2-noemgd/build/build/tmp/work/core2-poky-linux/gcc-cross-initial-4.6.2+svnr181430-r22/gcc-4_6-branch/build.x86_64-linux.i586-poky-linux/./gcc/ -E&quot; fails sanity check
| See `config.log&apos; for more details.
| make[1]: *** [configure-target-libgcc] Error 1
| make[1]: Leaving directory `/srv/home/pokybuild/yocto-autobuilder/yocto-slave/fri2-noemgd/build/build/tmp/work/core2-poky-linux/gcc-cross-initial-4.6.2+svnr181430-r22/gcc-4_6-branch/build.x86_64-linux.i586-poky-linux&apos;
| make: *** [all] Error 2
| ERROR: oe_runmake failed</thetext>
  </long_desc><long_desc isprivate="0" >
    <commentid>18439</commentid>
    <comment_count>1</comment_count>
    <who name="Nitin Kamble">nitin.a.kamble</who>
    <bug_when>2012-01-31 13:42:34 +0000</bug_when>
    <thetext>Jessica,
  can you provide steps to reproduce the issue ?

Nitin</thetext>
  </long_desc><long_desc isprivate="0" >
    <commentid>18440</commentid>
    <comment_count>2</comment_count>
    <who name="Jessica">jessica.zhang</who>
    <bug_when>2012-01-31 13:49:57 +0000</bug_when>
    <thetext>Here&apos;s the setup of AB that ran into the issue:

yocto-autobuild &apos;core-image-lsb core-image-lsb-sdk&apos; -k
 in dir /srv/home/pokybuild/yocto-autobuilder/yocto-slave/fri2-noemgd/build (timeout 14400 secs)
 watching logfiles {}
 argv: [&apos;yocto-autobuild&apos;, &apos;core-image-lsb core-image-lsb-sdk&apos;, &apos;-k&apos;]
 environment:
  ABTARGET=fri2-noemgd
  BSP_BRANCH=master
  BSP_REPO=git://git.pokylinux.org/meta-intel.git
  BSP_REV=HEAD
  BSP_WORKDIR=build/yocto/meta-intel
  BTARGET=fri2
  BUILDSTRING=
  BUILD_PUBLISH_DIR=/srv/www/vhosts/autobuilder.yoctoproject.org/pub/
  CLEAN_SOURCE_DIR=False
  COLORTERM=1
  CPU=x86_64
  CSHEDIT=emacs
  CVS_RSH=ssh
  DEST=
  DISTRO=poky-lsb
  DL_DIR=/srv/www/vhosts/autobuilder.yoctoproject.org/current_sources
  EDITOR=vim
  ENABLE_SWABBER=false
  FROM_HEADER=
  FuzzArch=
  FuzzImage=
  FuzzSDK=
  GIT_PROXY_COMMAND=/usr/local/bin/git-proxy
  GPG_TTY=/dev/pts/0
  G_BROKEN_FILENAMES=1
  G_FILENAME_ENCODING=@locale,UTF-8,ISO-8859-15,CP1252
  HISTSIZE=1000
  HOME=/srv/home/pokybuild
  HOST=yocto-iab08
  HOSTNAME=yocto-iab08
  HOSTTYPE=x86_64
  INPUTRC=/etc/inputrc
  LANG=en_US.UTF-8
  LD_LIBRARY_PATH=/usr/lib64/mpi/gcc/openmpi/lib64
  LESS=-M -I -R
  LESSCLOSE=lessclose.sh %s %s
  LESSKEY=/etc/lesskey.bin
  LESSOPEN=lessopen.sh %s
  LESS_ADVANCED_PREPROCESSOR=no
  LOGNAME=pokybuild
  LSB_SSTATE_DIR=/srv/www/vhosts/autobuilder.yoctoproject.org/pub/lsb-sstate
  LS_COLORS=no=00:fi=00:di=01;34:ln=00;36:pi=40;33:so=01;35:do=01;35:bd=40;33;01:cd=40;33;01:or=41;33;01:ex=00;32:*.cmd=00;32:*.exe=01;32:*.com=01;32:*.bat=01;32:*.btm=01;32:*.dll=01;32:*.tar=00;31:*.tbz=00;31:*.tgz=00;31:*.rpm=00;31:*.deb=00;31:*.arj=00;31:*.taz=00;31:*.lzh=00;31:*.lzma=00;31:*.zip=00;31:*.zoo=00;31:*.z=00;31:*.Z=00;31:*.gz=00;31:*.bz2=00;31:*.tb2=00;31:*.tz2=00;31:*.tbz2=00;31:*.xz=00;31:*.avi=01;35:*.bmp=01;35:*.fli=01;35:*.gif=01;35:*.jpg=01;35:*.jpeg=01;35:*.mng=01;35:*.mov=01;35:*.mpg=01;35:*.pcx=01;35:*.pbm=01;35:*.pgm=01;35:*.png=01;35:*.ppm=01;35:*.tga=01;35:*.tif=01;35:*.xbm=01;35:*.xpm=01;35:*.dl=01;35:*.gl=01;35:*.wmv=01;35:*.aiff=00;32:*.au=00;32:*.mid=00;32:*.mp3=00;32:*.ogg=00;32:*.voc=00;32:*.wav=00;32:
  LS_OPTIONS=-N --color=tty -T 0
  MACHINE=fri2-noemgd
  MACHTYPE=x86_64-suse-linux
  MAIL=/var/spool/mail/pokybuild
  MAKEFLAGS=
  MAKELEVEL=1
  MANPATH=/usr/lib64/mpi/gcc/openmpi/share/man:/usr/local/man:/usr/share/man
  MFLAGS=
  MINICOM=-c on
  MORE=-sl
  NNTPSERVER=news
  NO_PROXY=localhost, 127.0.0.1, intel.com, 10.0.0.0/8
  OLDPWD=/srv/home/pokybuild
  OSTYPE=linux
  PAGER=less
  PATH=/srv/home/pokybuild/yocto-autobuilder/bin:/srv/home/pokybuild/yocto-autobuilder/yocto-autobuilder/scripts:/usr/lib64/mpi/gcc/openmpi/bin:/usr/local/bin:/usr/bin:/bin:/usr/bin/X11:/usr/X11R6/bin:/usr/games
  PROFILEREAD=true
  PUBLISH_BUILDS=True
  PUBLISH_SOURCE_MIRROR=True
  PUBLISH_SSTATE=False
  PWD=/srv/home/pokybuild/yocto-autobuilder/yocto-slave/fri2-noemgd/build
  PYTHONPATH=/srv/home/pokybuild/yocto-autobuilder/lib/python2.6/site-packages/:
  PYTHONSTARTUP=/etc/pythonstart
  QT_SYSTEM_DIR=/usr/share/desktop-data
  RELEASE=
  REVISION=HEAD
  SDKMACHINE=x86_64
  SHELL=/bin/bash
  SHLVL=1
  SLAVEBASEDIR=/srv/home/pokybuild/yocto-autobuilder/yocto-slave
  SOURCE_DL_DIR=/srv/www/vhosts/autobuilder.yoctoproject.org/current_sources
  SOURCE_PUBLISH_DIR=/srv/www/vhosts/autobuilder.yoctoproject.org/pub/sources
  SOURCE_SSTATE_DIR=/srv/www/vhosts/autobuilder.yoctoproject.org/pub/sstate
  SSTATE_DIR=/srv/www/vhosts/autobuilder.yoctoproject.org/pub/sstate
  SSTATE_PUBLISH_DIR=/srv/www/vhosts/sstate.yoctoproject.org/
  TERM=xterm
  USER=pokybuild
  WINDOWMANAGER=/usr/bin/twm
  WORKDIR=
  XCURSOR_THEME=DMZ
  XDG_CONFIG_DIRS=/etc/xdg
  XDG_DATA_DIRS=/usr/share
  XKEYSYMDB=/usr/X11R6/lib/X11/XKeysymDB
  XNLSPATH=/usr/share/X11/nls
  _=./yocto-start-autobuilder
  ftp_proxy=http://proxy.jf.intel.com:911/
  http_proxy=http://proxy.jf.intel.com:911/
  https_proxy=https://proxy.jf.intel.com:911/
  machine=
  mc=() {  . /usr/share/mc/mc-wrapper.sh
}</thetext>
  </long_desc><long_desc isprivate="0" >
    <commentid>18441</commentid>
    <comment_count>3</comment_count>
    <who name="Nitin Kamble">nitin.a.kamble</who>
    <bug_when>2012-01-31 15:38:13 +0000</bug_when>
    <thetext>Tried. Can not reproduce the issue locally. The build succeeded without any errors.</thetext>
  </long_desc><long_desc isprivate="0" >
    <commentid>18445</commentid>
    <comment_count>4</comment_count>
    <who name="Jessica">jessica.zhang</who>
    <bug_when>2012-02-01 08:49:28 +0000</bug_when>
    <thetext>clean sstate on autobuilder dismissed the error</thetext>
  </long_desc><long_desc isprivate="0" >
    <commentid>18446</commentid>
    <comment_count>5</comment_count>
    <who name="Nitin Kamble">nitin.a.kamble</who>
    <bug_when>2012-02-01 08:53:54 +0000</bug_when>
    <thetext>was not a bug</thetext>
  </long_desc>
      
      

    </bug>

</bugzilla>