<?xml version="1.0" encoding="UTF-8" standalone="yes" ?>
<!DOCTYPE bugzilla SYSTEM "https://bugzilla.yoctoproject.org/page.cgi?id=bugzilla.dtd">

<bugzilla version="5.0.6"
          urlbase="https://bugzilla.yoctoproject.org/"
          
          maintainer="it-coreprojects-helpdesk@linuxfoundation.org"
>

    <bug>
          <bug_id>2293</bug_id>
          
          <creation_ts>2012-04-13 19:15:58 +0000</creation_ts>
          <short_desc>grub-efi-native build fails on fedora 17 alpha</short_desc>
          <delta_ts>2012-04-16 17:23:06 +0000</delta_ts>
          <reporter_accessible>1</reporter_accessible>
          <cclist_accessible>1</cclist_accessible>
          <classification_id>7</classification_id>
          <classification>Build System, Metadata &amp; Runtime</classification>
          <product>OE-Core</product>
          <component>core</component>
          <version>unspecified</version>
          <rep_platform>x86</rep_platform>
          <op_sys>Multiple</op_sys>
          <bug_status>RESOLVED</bug_status>
          <resolution>FIXED</resolution>
          
          
          <bug_file_loc></bug_file_loc>
          <status_whiteboard></status_whiteboard>
          <keywords></keywords>
          <priority>Medium</priority>
          <bug_severity>normal</bug_severity>
          <target_milestone>1.2 M4</target_milestone>
          
          
          <everconfirmed>1</everconfirmed>
          <reporter name="Nitin Kamble">nitin.a.kamble</reporter>
          <assigned_to name="Nitin Kamble">nitin.a.kamble</assigned_to>
          <cc>meta.mr.watcher</cc>
    
    <cc>meta.watcher</cc>
          
          
          <cf_os>---</cf_os>
          <cf_regression_type>---</cf_regression_type>
          
          <cf_docchange>---</cf_docchange>

      

      

      

          <comment_sort_order>oldest_to_newest</comment_sort_order>  
          <long_desc isprivate="0" >
    <commentid>20339</commentid>
    <comment_count>0</comment_count>
    <who name="Nitin Kamble">nitin.a.kamble</who>
    <bug_when>2012-04-13 19:15:58 +0000</bug_when>
    <thetext>| make[3]: Entering directory `/home/nitin/builds/build0/tmp/work/x86_64-linux/grub-efi-i586-native-1.99-r6/grub-1.99/grub-core&apos;
| gcc -O2 -pipe -g -feliminate-unused-debug-types -Wall -W -Wshadow -Wpointer-arith -Wmissing-prototypes -Wundef -Wstrict-prototypes -g -falign-jumps=1 -falign-loops=1 -falign-functions=1 -mno-mmx -mno-sse -mno-sse2 -mno-3dnow -fno-dwarf2-cfi-asm -m32 -fno-stack-protector -mno-stack-arg-probe -Werror -Wno-trampolines          -ffreestanding  -isystem/home/nitin/builds/build0/tmp/sysroots/x86_64-linux/usr/include -O2 -pipe -Wl,-O1 -Wl,--hash-style=gnu -Wl,--as-needed -m32 -Wl,--build-id=none  -melf_i386 -nostdlib -Wl,-N,-r,-d  -L/home/nitin/builds/build0/tmp/sysroots/x86_64-linux/usr/lib -L/home/nitin/builds/build0/tmp/sysroots/x86_64-linux/lib -Wl,-rpath-link,/home/nitin/builds/build0/tmp/sysroots/x86_64-linux/usr/lib -Wl,-rpath-link,/home/nitin/builds/build0/tmp/sysroots/x86_64-linux/lib -Wl,-rpath,/home/nitin/builds/build0/tmp/sysroots/x86_64-linux/usr/lib -Wl,-rpath,/home/nitin/builds/build0/tmp/sysroots/x86_64-linux/lib -Wl,-O1 -o trig.module  trig_module-trigtables.o
| gcc: error: unrecognized command line option &apos;-melf_i386&apos;
| make[3]: *** [trig.module] Error 1</thetext>
  </long_desc><long_desc isprivate="0" >
    <commentid>20340</commentid>
    <comment_count>1</comment_count>
    <who name="Nitin Kamble">nitin.a.kamble</who>
    <bug_when>2012-04-13 19:16:29 +0000</bug_when>
    <thetext>the reason for failure is gcc 4.7 on fedora 17</thetext>
  </long_desc><long_desc isprivate="0" >
    <commentid>20344</commentid>
    <comment_count>2</comment_count>
    <who name="Nitin Kamble">nitin.a.kamble</who>
    <bug_when>2012-04-13 19:36:47 +0000</bug_when>
    <thetext>After fixing the -melf_i386 issue, a new error is thrown:

| make[3]: Entering directory `/home/nitin/builds/build0/tmp/work/x86_64-linux/grub-efi-i586-native-1.99-r7/grub-1.99/grub-core&apos;
| gcc -DHAVE_CONFIG_H -I. -I..  -Wall -W -I../include -I../include  -DGRUB_MACHINE_EFI=1 -DGRUB_MACHINE=I386_EFI -nostdinc -isystem /usr/lib/gcc/x86_64-redhat-linux/4.7.0/include -DGRUB_FILE=\&quot;fs/btrfs.c\&quot; -I. -I. -I.. -I.. -I../include -I../include    -isystem/home/nitin/builds/build0/tmp/sysroots/x86_64-linux/usr/include -O2 -pipe -g -feliminate-unused-debug-types -Wall -W -Wshadow -Wpointer-arith -Wmissing-prototypes -Wundef -Wstrict-prototypes -g -falign-jumps=1 -falign-loops=1 -falign-functions=1 -mno-mmx -mno-sse -mno-sse2 -mno-3dnow -fno-dwarf2-cfi-asm -m32 -fno-stack-protector -mno-stack-arg-probe -Werror -Wno-trampolines          -ffreestanding  -isystem/home/nitin/builds/build0/tmp/sysroots/x86_64-linux/usr/include -O2 -pipe -c -o fs/btrfs_module-btrfs.o `test -f &apos;fs/btrfs.c&apos; || echo &apos;./&apos;`fs/btrfs.c
| fs/btrfs.c: In function &apos;grub_btrfs_read_logical&apos;:
| fs/btrfs.c:791:5: error: &apos;err&apos; may be used uninitialized in this function [-Werror=maybe-uninitialized]
| fs/btrfs.c:592:18: note: &apos;err&apos; was declared here
| cc1: all warnings being treated as errors
| make[3]: *** [fs/btrfs_module-btrfs.o] Error 1</thetext>
  </long_desc><long_desc isprivate="0" >
    <commentid>20346</commentid>
    <comment_count>3</comment_count>
    <who name="Nitin Kamble">nitin.a.kamble</who>
    <bug_when>2012-04-13 20:13:26 +0000</bug_when>
    <thetext>after fixing the uninitialized error, seeing these errors now

| gcc -DHAVE_CONFIG_H -I. -I..  -Wall -W -I../include -I../include  -DGRUB_MACHINE_EFI=1 -DGRUB_MACHINE=I386_EFI -no
stdinc -isystem /usr/lib/gcc/x86_64-redhat-linux/4.7.0/include -DGRUB_FILE=\&quot;fs/zfs/zfs.c\&quot; -I. -I. -I.. -I.. -I../i
nclude -I../include    -isystem/home/nitin/builds/build0/tmp/sysroots/x86_64-linux/usr/include -O2 -pipe -g -felimin
ate-unused-debug-types -Wall -W -Wshadow -Wpointer-arith -Wmissing-prototypes -Wundef -Wstrict-prototypes -g -falign
-jumps=1 -falign-loops=1 -falign-functions=1 -mno-mmx -mno-sse -mno-sse2 -mno-3dnow -fno-dwarf2-cfi-asm -m32 -fno-st
ack-protector -mno-stack-arg-probe -Werror -Wno-trampolines          -ffreestanding  -isystem/home/nitin/builds/buil
d0/tmp/sysroots/x86_64-linux/usr/include -O2 -pipe -c -o fs/zfs/zfs_module-zfs.o `test -f &apos;fs/zfs/zfs.c&apos; || echo &apos;./
&apos;`fs/zfs/zfs.c
| fs/zfs/zfs.c: In function &apos;get_filesystem_dnode&apos;:
| fs/zfs/zfs.c:1449:7: error: dereferencing type-punned pointer will break strict-aliasing rules [-Werror=strict-ali
asing]
| fs/zfs/zfs.c:1449:7: error: dereferencing type-punned pointer will break strict-aliasing rules [-Werror=strict-ali
asing]
| fs/zfs/zfs.c: In function &apos;make_mdn&apos;:
| fs/zfs/zfs.c:1478:3: error: dereferencing type-punned pointer will break strict-alERROR: Function failed: do_compile (see /home/nitin/builds/build0/tmp/work/x86_64-linux/grub-efi-i586-native-1.99-r7/temp/log.do_compile.16197 for further information)
| iasing rules [-Werror=strict-aliasing]
| fs/zfs/zfs.c: In function &apos;dnode_get_fullpath&apos;:
| fs/zfs/zfs.c:1554:3: error: dereferencing type-punned pointer will break strict-aliasing rules [-Werror=strict-aliasing]
| fs/zfs/zfs.c:1554:3: error: dereferencing type-punned pointer will break strict-aliasing rules [-Werror=strict-aliasing]
| fs/zfs/zfs.c:1571:7: error: dereferencing type-punned pointer will break strict-aliasing rules [-Werror=strict-aliasing]
| fs/zfs/zfs.c:1571:7: error: dereferencing type-punned pointer will break strict-aliasing rules [-Werror=strict-aliasing]
| fs/zfs/zfs.c: In function &apos;grub_zfs_open&apos;:
| fs/zfs/zfs.c:2234:7: error: dereferencing type-punned pointer will break strict-aliasing rules [-Werror=strict-aliasing]
| fs/zfs/zfs.c:2234:7: error: dereferencing type-punned pointer will break strict-aliasing rules [-Werror=strict-aliasing]
| fs/zfs/zfs.c: In function &apos;fill_fs_info&apos;:
| fs/zfs/zfs.c:2362:7: error: dereferencing type-punned pointer will break strict-aliasing rules [-Werror=strict-aliasing]
| fs/zfs/zfs.c:2362:7: error: dereferencing type-punned pointer will break strict-aliasing rules [-Werror=strict-aliasing]
| fs/zfs/zfs.c:2395:3: error: dereferencing type-punned pointer will break strict-aliasing rules [-Werror=strict-aliasing]
| fs/zfs/zfs.c:2395:3: error: dereferencing type-punned pointer will break strict-aliasing rules [-Werror=strict-aliasing]
| fs/zfs/zfs.c: In function &apos;iterate_zap&apos;:
| fs/zfs/zfs.c:2420:5: error: dereferencing type-punned pointer will break strict-aliasing rules [-Werror=strict-aliasing]
| fs/zfs/zfs.c:2420:5: error: dereferencing type-punned pointer will break strict-aliasing rules [-Werror=strict-aliasing]
| fs/zfs/zfs.c: In function &apos;grub_zfs_dir&apos;:
| fs/zfs/zfs.c:2483:7: error: dereferencing type-punned pointer will break strict-aliasing rules [-Werror=strict-aliasing]
| fs/zfs/zfs.c:2483:7: error: dereferencing type-punned pointer will break strict-aliasing rules [-Werror=strict-aliasing]
| fs/zfs/zfs.c:2484:7: error: dereferencing type-punned pointer will break strict-aliasing rules [-Werror=strict-aliasing]
| fs/zfs/zfs.c:2484:7: error: dereferencing type-punned pointer will break strict-aliasing rules [-Werror=strict-aliasing]
| fs/zfs/zfs.c:2502:7: error: dereferencing type-punned pointer will break strict-aliasing rules [-Werror=strict-aliasing]
| fs/zfs/zfs.c:2502:7: error: dereferencing type-punned pointer will break strict-aliasing rules [-Werror=strict-aliasing]
| cc1: all warnings being treated as errors</thetext>
  </long_desc><long_desc isprivate="0" >
    <commentid>20349</commentid>
    <comment_count>4</comment_count>
    <who name="Nitin Kamble">nitin.a.kamble</who>
    <bug_when>2012-04-13 22:40:37 +0000</bug_when>
    <thetext>I have fix for all the errors now, will send out the commit to ML soon.</thetext>
  </long_desc><long_desc isprivate="0" >
    <commentid>20459</commentid>
    <comment_count>5</comment_count>
    <who name="Nitin Kamble">nitin.a.kamble</who>
    <bug_when>2012-04-16 17:23:06 +0000</bug_when>
    <thetext>fixed by this commit in the master
commit 3d23afdc7a7f79ebdb324fd97d45420ca62dd869
Author: Nitin A Kamble &lt;nitin.a.kamble@intel.com&gt;
Date:   Sat Apr 14 01:59:07 2012 -0700

    grub-efi-native, grub: fix build with gcc 4.7

    This fixes bug [YOCTO #2293]

    These build failure caused by gcc4.7 is fixed with a backport of a
    grub-1.99 patch from fedora 17 alpha plus two more new patches</thetext>
  </long_desc>
      
      

    </bug>

</bugzilla>