<?xml version="1.0" encoding="UTF-8" standalone="yes" ?>
<!DOCTYPE bugzilla SYSTEM "https://bugzilla.yoctoproject.org/page.cgi?id=bugzilla.dtd">

<bugzilla version="5.0.6"
          urlbase="https://bugzilla.yoctoproject.org/"
          
          maintainer="it-coreprojects-helpdesk@linuxfoundation.org"
>

    <bug>
          <bug_id>2362</bug_id>
          
          <creation_ts>2012-04-23 08:54:52 +0000</creation_ts>
          <short_desc>pseudo-native failed to compile on opensuse12.1 64bit</short_desc>
          <delta_ts>2012-06-13 08:22:18 +0000</delta_ts>
          <reporter_accessible>1</reporter_accessible>
          <cclist_accessible>1</cclist_accessible>
          <classification_id>7</classification_id>
          <classification>Build System, Metadata &amp; Runtime</classification>
          <product>OE-Core</product>
          <component>core</component>
          <version>1.2</version>
          <rep_platform>x86</rep_platform>
          <op_sys>Multiple</op_sys>
          <bug_status>VERIFIED</bug_status>
          <resolution>FIXED</resolution>
          
          
          <bug_file_loc></bug_file_loc>
          <status_whiteboard></status_whiteboard>
          <keywords></keywords>
          <priority>Medium</priority>
          <bug_severity>normal</bug_severity>
          <target_milestone>1.2.1</target_milestone>
          
          
          <everconfirmed>1</everconfirmed>
          <reporter name="yilong, sun">yilongx.y.sun</reporter>
          <assigned_to name="Richard Purdie">richard.purdie</assigned_to>
          <cc>jessica.zhang</cc>
    
    <cc>jiajun.xu</cc>
    
    <cc>meta.mr.watcher</cc>
    
    <cc>meta.watcher</cc>
    
    <cc>richard.purdie</cc>
    
    <cc>sgw</cc>
          
          
          <cf_os>---</cf_os>
          <cf_regression_type>---</cf_regression_type>
          
          <cf_docchange>---</cf_docchange>

      

      

      

          <comment_sort_order>oldest_to_newest</comment_sort_order>  
          <long_desc isprivate="0" >
    <commentid>20810</commentid>
    <comment_count>0</comment_count>
    <who name="yilong, sun">yilongx.y.sun</who>
    <bug_when>2012-04-23 08:54:52 +0000</bug_when>
    <thetext>With 1.2 M4 rc4 branch , Package pseudo-native compile failed. it seems file path error.

tree/branch: poky/denzil
commit: 2c3d4f5beee8f57a74244495511b9294df1085ea

Detailed error information as follows：

Pseudo is not present but is required, building this first before the main build
Loading cache...done.
Loaded 1106 entries from dependency cache.

OE Build Configuration:
BB_VERSION        = &quot;1.15.1&quot;
TARGET_ARCH       = &quot;mips&quot;
TARGET_OS         = &quot;linux&quot;
MACHINE           = &quot;qemumips&quot;
DISTRO            = &quot;poky&quot;
DISTRO_VERSION    = &quot;1.2&quot;
TUNE_FEATURES     = &quot;o32 bigendian fpu-hard mips32&quot;
TARGET_FPU        = &quot;&quot;
meta              
meta-yocto        = &quot;1.2M4RC4:2c3d4f5beee8f57a74244495511b9294df1085ea&quot;

NOTE: Resolving any missing task queue dependencies
NOTE: Preparing runqueue
NOTE: Executing SetScene Tasks
NOTE: Executing RunQueue Tasks
NOTE: Running task 61 of 63 (ID: 6, virtual:native:/distro/poky/meta/recipes-devtools/pseudo/pseudo_1.3.bb, do_compile)
NOTE: package pseudo-native-1.3-r9: task do_compile: Started
ERROR: Function failed: do_compile (see /distro/poky/1.2M4RC4-SUSE/tmp/work/i686-linux/pseudo-native-1.3-r9/temp/log.do_compile.28662 for further information)
ERROR: Logfile of failure stored in: /distro/poky/1.2M4RC4-SUSE/tmp/work/i686-linux/pseudo-native-1.3-r9/temp/log.do_compile.28662
Log data follows:
| ERROR: Function failed: do_compile (see /distro/poky/1.2M4RC4-SUSE/tmp/work/i686-linux/pseudo-native-1.3-r9/temp/log.do_compile.28662 for further information)
| SQLite header for version 3007010 found.
| NOTE: make -j 4 -e MAKEFLAGS=
| gcc -fno-strict-aliasing -isystem/distro/poky/1.2M4RC4-SUSE/tmp/sysroots/i686-linux/usr/include -O2 -pipe -pipe -std=gnu99 -Wall -W -Wextra -fPIC -D_LARGEFILE64_SOURCE -D_ATFILE_SOURCE -m32 -DPSEUDO_PREFIX=&apos;&quot;/distro/poky/1.2M4RC4-SUSE/tmp/sysroots/i686-linux/usr&quot;&apos; -DPSEUDO_SUFFIX=&apos;&quot;&quot;&apos; -DPSEUDO_BINDIR=&apos;&quot;bin&quot;&apos; -DPSEUDO_LIBDIR=&apos;&quot;lib/pseudo/lib&quot;&apos; -DPSEUDO_LOCALSTATEDIR=&apos;&quot;var/pseudo&quot;&apos; -DPSEUDO_VERSION=&apos;&quot;1.3&quot;&apos; -O2 -g -L/distro/poky/1.2M4RC4-SUSE/tmp/sysroots/i686-linux/usr/lib -I/distro/poky/1.2M4RC4-SUSE/tmp/sysroots/i686-linux/usr/include  -D_GNU_SOURCE -c -o pseudo_wrappers.o pseudo_wrappers.c
| gcc -c -isystem/distro/poky/1.2M4RC4-SUSE/tmp/sysroots/i686-linux/usr/include -isystem/distro/poky/1.2M4RC4-SUSE/tmp/sysroots/i686-linux/usr/include -O2 -pipe -pipe -std=gnu99 -Wall -W -Wextra -fPIC -D_LARGEFILE64_SOURCE -D_ATFILE_SOURCE -m32 -DPSEUDO_PREFIX=&apos;&quot;/distro/poky/1.2M4RC4-SUSE/tmp/sysroots/i686-linux/usr&quot;&apos; -DPSEUDO_SUFFIX=&apos;&quot;&quot;&apos; -DPSEUDO_BINDIR=&apos;&quot;bin&quot;&apos; -DPSEUDO_LIBDIR=&apos;&quot;lib/pseudo/lib&quot;&apos; -DPSEUDO_LOCALSTATEDIR=&apos;&quot;var/pseudo&quot;&apos; -DPSEUDO_VERSION=&apos;&quot;1.3&quot;&apos; -O2 -g -L/distro/poky/1.2M4RC4-SUSE/tmp/sysroots/i686-linux/usr/lib -I/distro/poky/1.2M4RC4-SUSE/tmp/sysroots/i686-linux/usr/include  pseudo_client.c
| gcc -c -isystem/distro/poky/1.2M4RC4-SUSE/tmp/sysroots/i686-linux/usr/include -isystem/distro/poky/1.2M4RC4-SUSE/tmp/sysroots/i686-linux/usr/include -O2 -pipe -pipe -std=gnu99 -Wall -W -Wextra -fPIC -D_LARGEFILE64_SOURCE -D_ATFILE_SOURCE -m32 -DPSEUDO_PREFIX=&apos;&quot;/distro/poky/1.2M4RC4-SUSE/tmp/sysroots/i686-linux/usr&quot;&apos; -DPSEUDO_SUFFIX=&apos;&quot;&quot;&apos; -DPSEUDO_BINDIR=&apos;&quot;bin&quot;&apos; -DPSEUDO_LIBDIR=&apos;&quot;lib/pseudo/lib&quot;&apos; -DPSEUDO_LOCALSTATEDIR=&apos;&quot;var/pseudo&quot;&apos; -DPSEUDO_VERSION=&apos;&quot;1.3&quot;&apos; -O2 -g -L/distro/poky/1.2M4RC4-SUSE/tmp/sysroots/i686-linux/usr/lib -I/distro/poky/1.2M4RC4-SUSE/tmp/sysroots/i686-linux/usr/include  pseudo_ipc.c
| gcc -isystem/distro/poky/1.2M4RC4-SUSE/tmp/sysroots/i686-linux/usr/include -O2 -pipe -pipe -std=gnu99 -Wall -W -Wextra -fPIC -D_LARGEFILE64_SOURCE -D_ATFILE_SOURCE -m32 -DPSEUDO_PREFIX=&apos;&quot;/distro/poky/1.2M4RC4-SUSE/tmp/sysroots/i686-linux/usr&quot;&apos; -DPSEUDO_SUFFIX=&apos;&quot;&quot;&apos; -DPSEUDO_BINDIR=&apos;&quot;bin&quot;&apos; -DPSEUDO_LIBDIR=&apos;&quot;lib/pseudo/lib&quot;&apos; -DPSEUDO_LOCALSTATEDIR=&apos;&quot;var/pseudo&quot;&apos; -DPSEUDO_VERSION=&apos;&quot;1.3&quot;&apos; -O2 -g -L/distro/poky/1.2M4RC4-SUSE/tmp/sysroots/i686-linux/usr/lib -I/distro/poky/1.2M4RC4-SUSE/tmp/sysroots/i686-linux/usr/include  -c -o pseudo_tables.o pseudo_tables.c
| In file included from /usr/include/features.h:382:0,
|                  from /usr/include/stdio.h:28,
|                  from pseudo_client.c:20:
| /usr/include/gnu/stubs.h:7:27: fatal error: gnu/stubs-32.h: No such file or directory
| compilation terminated.
| In file included from /usr/include/features.h:382:0,
|                  from /usr/include/assert.h:37,
|                  from pseudo_wrappers.c:20:
| /usr/include/gnu/stubs.h:7:27: fatal error: gnu/stubs-32.h: No such file or directory
| compilation terminated.
| In file included from /usr/include/features.h:382:0,
|                  from /usr/include/stdlib.h:25,
|                  from pseudo_ipc.c:21:
| /usr/include/gnu/stubs.h:7:27: fatal error: gnu/stubs-32.h: No such file or directory
| make: compilation terminated.
| *** [pseudo_wrappers.o] Error 1
| make: *** Waiting for unfinished jobs....
| make: *** [pseudo_client.o] Error 1
| make: *** [pseudo_ipc.o] Error 1
| In file included from /usr/include/features.h:382:0,
|                  from /usr/include/string.h:27,
|                  from pseudo_tables.h:24,
|                  from pseudo_tables.c:23:
| /usr/include/gnu/stubs.h:7:27: fatal error: gnu/stubs-32.h: No such file or directory
| compilation terminated.
| make: *** [pseudo_tables.o] Error 1
| ERROR: oe_runmake failed
NOTE: package pseudo-native-1.3-r9: task do_compile: Failed
ERROR: Task 6 (virtual:native:/distro/poky/meta/recipes-devtools/pseudo/pseudo_1.3.bb, do_compile) failed with exit code &apos;1&apos;
NOTE: Tasks Summary: Attempted 61 tasks of which 60 didn&apos;t need to be rerun and 1 failed.

Summary: 1 task failed:
  virtual:native:/distro/poky/meta/recipes-devtools/pseudo/pseudo_1.3.bb, do_compile
Summary: There was 1 ERROR message shown, returning a non-zero exit code.</thetext>
  </long_desc><long_desc isprivate="0" >
    <commentid>20815</commentid>
    <comment_count>1</comment_count>
    <who name="Richard Purdie">richard.purdie</who>
    <bug_when>2012-04-23 10:36:22 +0000</bug_when>
    <thetext>Does this system have /bin/sh as bash or dash?</thetext>
  </long_desc><long_desc isprivate="0" >
    <commentid>20822</commentid>
    <comment_count>2</comment_count>
    <who name="Saul Wold">sgw</who>
    <bug_when>2012-04-23 15:36:38 +0000</bug_when>
    <thetext>This may be fixed already by a change in denzil after RC4</thetext>
  </long_desc><long_desc isprivate="0" >
    <commentid>20898</commentid>
    <comment_count>3</comment_count>
    <who name="yilong, sun">yilongx.y.sun</who>
    <bug_when>2012-04-27 01:14:19 +0000</bug_when>
    <thetext>Verify the bug as fixed in denzil branch with commit
35196ff703726addf7f4051ee09d70bf9ee0c5d0.</thetext>
  </long_desc><long_desc isprivate="0" >
    <commentid>20905</commentid>
    <comment_count>4</comment_count>
    <who name="Richard Purdie">richard.purdie</who>
    <bug_when>2012-04-27 08:23:08 +0000</bug_when>
    <thetext>Fixed as in the previous comment.</thetext>
  </long_desc><long_desc isprivate="0" >
    <commentid>22103</commentid>
    <comment_count>5</comment_count>
    <who name="yilong, sun">yilongx.y.sun</who>
    <bug_when>2012-06-13 08:22:18 +0000</bug_when>
    <thetext>Verify this bug as fixed</thetext>
  </long_desc>
      
      

    </bug>

</bugzilla>