<?xml version="1.0" encoding="UTF-8" standalone="yes" ?>
<!DOCTYPE bugzilla SYSTEM "https://bugzilla.yoctoproject.org/page.cgi?id=bugzilla.dtd">

<bugzilla version="5.0.6"
          urlbase="https://bugzilla.yoctoproject.org/"
          
          maintainer="it-coreprojects-helpdesk@linuxfoundation.org"
>

    <bug>
          <bug_id>2693</bug_id>
          
          <creation_ts>2012-07-04 15:06:47 +0000</creation_ts>
          <short_desc>Yocto BSP create via JSON file fails</short_desc>
          <delta_ts>2012-09-20 21:20:58 +0000</delta_ts>
          <reporter_accessible>1</reporter_accessible>
          <cclist_accessible>1</cclist_accessible>
          <classification_id>7</classification_id>
          <classification>Build System, Metadata &amp; Runtime</classification>
          <product>BitBake</product>
          <component>bitbake</component>
          <version>1.2.1</version>
          <rep_platform>x86</rep_platform>
          <op_sys>Multiple</op_sys>
          <bug_status>VERIFIED</bug_status>
          <resolution>FIXED</resolution>
          
          
          <bug_file_loc></bug_file_loc>
          <status_whiteboard></status_whiteboard>
          <keywords></keywords>
          <priority>Medium</priority>
          <bug_severity>normal</bug_severity>
          <target_milestone>1.3 M4</target_milestone>
          
          
          <everconfirmed>1</everconfirmed>
          <reporter name="Laurentiu Serban">laurentiu.serban</reporter>
          <assigned_to name="Tom Zanussi">tom.zanussi</assigned_to>
          <cc>alexandru.c.georgescu</cc>
    
    <cc>dvhart</cc>
    
    <cc>jessica.zhang</cc>
    
    <cc>opensource</cc>
    
    <cc>poky.bs.watcher</cc>
    
    <cc>poky.watcher</cc>
    
    <cc>song.liu</cc>
          
          
          <cf_os>---</cf_os>
          <cf_regression_type>---</cf_regression_type>
          
          <cf_docchange>---</cf_docchange>

      

      

      

          <comment_sort_order>oldest_to_newest</comment_sort_order>  
          <long_desc isprivate="0" >
    <commentid>22798</commentid>
    <comment_count>0</comment_count>
      <attachid>623</attachid>
    <who name="Laurentiu Serban">laurentiu.serban</who>
    <bug_when>2012-07-04 15:06:47 +0000</bug_when>
    <thetext>Created attachment 623
log do patch json

Creating a BSP using JSON file fails.

Steps to reproduce:

1. A test.json file with the following content was created
{&quot;kernel_choice&quot;:&quot;linux-yocto_3.2&quot;,&quot;use_default_kernel&quot;:&quot;n&quot;,&quot;keyboard&quot;:&quot;y&quot;,&quot;qemuarch&quot;:&quot;i386&quot;,&quot;smp&quot;:&quot;y&quot;,&quot;touchscreen&quot;:&quot;n&quot;,&quot;need_new_kbranch&quot;:&quot;y&quot;,&quot;new_kbranch&quot;:&quot;standard/default/base&quot;}
2. The following command is run yocto-bsp create myqemux86 qemu -o myqemux86 -i test.json
3. local.conf is modified and myqemux86 MACHINE is set.

4 Run bitbake core-image-sato.

The following error is displayed:


NOTE: Running task 1784 of 4652 (ID: 548, virtual:native:/home/lserban/work/yocto/meta/recipes-core/glib-2.0/glib-2.0_2.30.3.bb, do_populate_sysroot)
ERROR: Function failed: do_patch (see /home/lserban/work/yocto/build/tmp/work/myqemux86-poky-linux/linux-yocto-3.2.18+git1+49f931bc294d5b6be60502bbd448cff5aa766235_1+8b8cfaaab2b8d79ac56e8c9a85bad9ae7bca399c-r1.1/temp/log.do_patch.10463 for further information)
ERROR: Logfile of failure stored in: /home/lserban/work/yocto/build/tmp/work/myqemux86-poky-linux/linux-yocto-3.2.18+git1+49f931bc294d5b6be60502bbd448cff5aa766235_1+8b8cfaaab2b8d79ac56e8c9a85bad9ae7bca399c-r1.1/temp/log.do_patch.10463
Log data follows:
| ERROR: Function failed: do_patch (see /home/lserban/work/yocto/build/tmp/work/myqemux86-poky-linux/linux-yocto-3.2.18+git1+49f931bc294d5b6be60502bbd448cff5aa766235_1+8b8cfaaab2b8d79ac56e8c9a85bad9ae7bca399c-r1.1/temp/log.do_patch.10463 for further information)
| checkpoint is already restored, nothing to do
| error: &apos;refs/heads/standard/default/base&apos; exists; cannot create &apos;refs/heads/standard/default/base/myqemux86&apos;
| fatal: Failed to lock ref for update: Not a directory
| warning: could not find (or was already included): features/logbuf/size-normal.scc
| warning: could not find (or was already included): user-patches.scc
| [INFO] validating against known patches  (myqemux86-base-meta)
| error: Your local changes to the following files would be overwritten by checkout:
|       Makefile
|       drivers/tty/serial/pch_uart.c
|       drivers/usb/host/pci-quirks.c
|       fs/namei.c
|       fs/nfs/super.c
|       fs/splice.c
|       include/linux/nfs_xdr.h
|       kernel/time/ntp.c
|       net/ipv4/arp.c
|       scripts/mod/modpost.c
| Please, commit your changes or stash them before you can switch branches.
| Aborting
| ERROR: could not checkout branch base
| ERROR. could not update git tree
| ERROR. Could not modify standard/default/base/myqemux86
NOTE: package linux-yocto-3.2.18+git1+49f931bc294d5b6be60502bbd448cff5aa766235_1+8b8cfaaab2b8d79ac56e8c9a85bad9ae7bca399c-r1.1: task do_patch: Failed
ERROR: Task 606 (/home/lserban/work/yocto/meta/recipes-kernel/linux/linux-yocto_3.2.bb, do_patch) failed with exit code &apos;1&apos;
Waiting for 6 running tasks to finish:

Attaching log</thetext>
  </long_desc><long_desc isprivate="0" >
    <commentid>23290</commentid>
    <comment_count>1</comment_count>
    <who name="Tom Zanussi">tom.zanussi</who>
    <bug_when>2012-07-19 20:24:01 +0000</bug_when>
    <thetext>This is happening because &apos;base&apos; doesn&apos;t get removed from standard/default/base.  Replacing standard/default/base with standard/default works in this case, but that shouldn&apos;t need to be done - this test case used to pass, not sure what broke it, but will look into it.</thetext>
  </long_desc><long_desc isprivate="0" >
    <commentid>23387</commentid>
    <comment_count>2</comment_count>
    <who name="Alexandru Georgescu">alexandru.c.georgescu</who>
    <bug_when>2012-07-23 12:20:11 +0000</bug_when>
    <thetext>Hi,
I have a similar error when trying to compile qemu for ARM:

| Traceback (most recent call last):
|   File &quot;util/setup.py&quot;, line 6, in &lt;module&gt;
|     from distutils.command.build_ext   import build_ext   as _build_ext
|   File &quot;/home/alex/git/poky/build/tmp/sysroots/x86_64-linux/usr/lib/python2.7/distutils/command/build_ext.py&quot;, line 16, in &lt;module&gt;
|     from distutils.sysconfig import customize_compiler, get_python_version
|   File &quot;/home/alex/git/poky/build/tmp/sysroots/x86_64-linux/usr/lib/python2.7/distutils/sysconfig.py&quot;, line 22, in &lt;module&gt;
|     PREFIX = os.path.normpath(sys.prefix).replace( os.getenv(&quot;BUILD_SYS&quot;), os.getenv(&quot;HOST_SYS&quot;) )
| TypeError: expected a character buffer object
| cp: cannot stat `python_ext_build/lib/peERROR: Function failed: do_compile_perf (see /home/alex/git/poky/build/tmp/work/myqemuarm-poky-linux-gnueabi/linux-yocto-3.2.11+git1+49f931bc294d5b6be60502bbd448cff5aa766235_1+f4f8ba730e7783e09413872414d0a17c142c816d-r1.1/temp/log.do_compile_perf.16178 for further information)
| rf.so&apos;: No such file or directory
| make: *** [python/perf.so] Error 1
| make: Leaving directory `/home/alex/git/poky/build/tmp/work/myqemuarm-poky-linux-gnueabi/linux-yocto-3.2.11+git1+49f931bc294d5b6be60502bbd448cff5aa766235_1+f4f8ba730e7783e09413872414d0a17c142c816d-r1.1/linux/tools/perf&apos;
| ERROR: oe_runmake failed
NOTE: package linux-yocto-3.2.11+git1+49f931bc294d5b6be60502bbd448cff5aa766235_1+f4f8ba730e7783e09413872414d0a17c142c816d-r1.1: task do_compile_perf: Failed
ERROR: Task 614 (/home/alex/git/poky/meta/recipes-kernel/linux/linux-yocto_3.2.bb, do_compile_perf) failed with exit code &apos;1&apos;
Waiting for 7 running tasks to finish:
0: perl-5.14.2-r6 do_compile (pid 2907)
1: gnome-keyring-2.32.1-r6 do_configure (pid 3290)
2: libcroco-0.6.3-r3 do_compile (pid 19533)
3: libsoup-2.4-2.38.1-r0 do_compile (pid 20229)
4: neon-0.29.6-r2 do_configure (pid 20268)
5: consolekit-0.4.5-r9 do_compile (pid 22715)
6: libglade-2.6.4-r3 do_package (pid 23612)
NOTE: package libcroco-0.6.3-r3: task do_compile: Succeeded
Waiting for 6 running tasks to finish:
0: perl-5.14.2-r6 do_compile (pid 2907)
1: gnome-keyring-2.32.1-r6 do_configure (pid 3290)
2: libsoup-2.4-2.38.1-r0 do_compile (pid 20229)
3: neon-0.29.6-r2 do_configure (pid 20268)
4: consolekit-0.4.5-r9 do_compile (pid 22715)
5: libglade-2.6.4-r3 do_package (pid 23612)
NOTE: package libglade-2.6.4-r3: task do_package: Succeeded
Waiting for 5 running tasks to finish:
0: perl-5.14.2-r6 do_compile (pid 2907)
1: gnome-keyring-2.32.1-r6 do_configure (pid 3290)
2: libsoup-2.4-2.38.1-r0 do_compile (pid 20229)
3: neon-0.29.6-r2 do_configure (pid 20268)
4: consolekit-0.4.5-r9 do_compile (pid 22715)
NOTE: package consolekit-0.4.5-r9: task do_compile: Succeeded
Waiting for 4 running tasks to finish:
0: perl-5.14.2-r6 do_compile (pid 2907)
1: gnome-keyring-2.32.1-r6 do_configure (pid 3290)
2: libsoup-2.4-2.38.1-r0 do_compile (pid 20229)
3: neon-0.29.6-r2 do_configure (pid 20268)
NOTE: package gnome-keyring-2.32.1-r6: task do_configure: Succeeded
Waiting for 3 running tasks to finish:
0: perl-5.14.2-r6 do_compile (pid 2907)
1: libsoup-2.4-2.38.1-r0 do_compile (pid 20229)
2: neon-0.29.6-r2 do_configure (pid 20268)
NOTE: package libsoup-2.4-2.38.1-r0: task do_compile: Succeeded
Waiting for 2 running tasks to finish:
0: perl-5.14.2-r6 do_compile (pid 2907)
1: neon-0.29.6-r2 do_configure (pid 20268)
NOTE: package neon-0.29.6-r2: task do_configure: Succeeded
Waiting for 1 running tasks to finish:
0: perl-5.14.2-r6 do_compile (pid 2907)
NOTE: package perl-5.14.2-r6: task do_compile: Succeeded
NOTE: Tasks Summary: Attempted 3587 tasks of which 1595 didn&apos;t need to be rerun and 1 failed.

Summary: 1 task failed:
  /home/alex/git/poky/meta/recipes-kernel/linux/linux-yocto_3.2.bb, do_compile_perf
Summary: There were 14 WARNING messages shown.
Summary: There was 1 ERROR message shown, returning a non-zero exit code.
alex@alex-pc:~/git/poky/build$</thetext>
  </long_desc><long_desc isprivate="0" >
    <commentid>23617</commentid>
    <comment_count>3</comment_count>
    <who name="Laurentiu Serban">laurentiu.serban</who>
    <bug_when>2012-07-30 21:19:48 +0000</bug_when>
    <thetext>This blocks 2559</thetext>
  </long_desc><long_desc isprivate="0" >
    <commentid>23618</commentid>
    <comment_count>4</comment_count>
    <who name="Tom Zanussi">tom.zanussi</who>
    <bug_when>2012-07-30 22:20:23 +0000</bug_when>
    <thetext>(In reply to comment #2)
&gt; Hi,
&gt; I have a similar error when trying to compile qemu for ARM:
&gt; 
&gt; | Traceback (most recent call last):
&gt; |   File &quot;util/setup.py&quot;, line 6, in &lt;module&gt;
&gt; |     from distutils.command.build_ext   import build_ext   as _build_ext
&gt; |   File
&gt; &quot;/home/alex/git/poky/build/tmp/sysroots/x86_64-linux/usr/lib/python2.7/
&gt; distutils/command/build_ext.py&quot;, line 16, in &lt;module&gt;
&gt; |     from distutils.sysconfig import customize_compiler, get_python_version
&gt; |   File
&gt; &quot;/home/alex/git/poky/build/tmp/sysroots/x86_64-linux/usr/lib/python2.7/
&gt; distutils/sysconfig.py&quot;, line 22, in &lt;module&gt;
&gt; |     PREFIX = os.path.normpath(sys.prefix).replace( os.getenv(&quot;BUILD_SYS&quot;),
&gt; os.getenv(&quot;HOST_SYS&quot;) )
&gt; | TypeError: expected a character buffer object
&gt; | cp: cannot stat `python_ext_build/lib/peERROR: Function failed:
&gt; do_compile_perf (see
&gt; /home/alex/git/poky/build/tmp/work/myqemuarm-poky-linux-gnueabi/linux-yocto-
&gt; 3.2.
&gt; 11+git1+49f931bc294d5b6be60502bbd448cff5aa766235_1+f4f8ba730e7783e09413872414
&gt; d0a17c142c816d-r1.1/temp/log.do_compile_perf.16178 for further information)
&gt; | rf.so&apos;: No such file or directory
&gt; | make: *** [python/perf.so] Error 1
&gt; | make: Leaving directory
&gt; `/home/alex/git/poky/build/tmp/work/myqemuarm-poky-linux-gnueabi/linux-yocto-
&gt; 3.2.
&gt; 11+git1+49f931bc294d5b6be60502bbd448cff5aa766235_1+f4f8ba730e7783e09413872414
&gt; d0a17c142c816d-r1.1/linux/tools/perf&apos;
&gt; | ERROR: oe_runmake failed
&gt; NOTE: package
&gt; linux-yocto-3.2.
&gt; 11+git1+49f931bc294d5b6be60502bbd448cff5aa766235_1+f4f8ba730e7783e09413872414
&gt; d0a17c142c816d-r1.1: task do_compile_perf: Failed
&gt; ERROR: Task 614
&gt; (/home/alex/git/poky/meta/recipes-kernel/linux/linux-yocto_3.2.bb,
&gt; do_compile_perf) failed with exit code &apos;1&apos;
&gt; Waiting for 7 running tasks to finish:
&gt; 0: perl-5.14.2-r6 do_compile (pid 2907)
&gt; 1: gnome-keyring-2.32.1-r6 do_configure (pid 3290)
&gt; 2: libcroco-0.6.3-r3 do_compile (pid 19533)
&gt; 3: libsoup-2.4-2.38.1-r0 do_compile (pid 20229)
&gt; 4: neon-0.29.6-r2 do_configure (pid 20268)
&gt; 5: consolekit-0.4.5-r9 do_compile (pid 22715)
&gt; 6: libglade-2.6.4-r3 do_package (pid 23612)
&gt; NOTE: package libcroco-0.6.3-r3: task do_compile: Succeeded
&gt; Waiting for 6 running tasks to finish:
&gt; 0: perl-5.14.2-r6 do_compile (pid 2907)
&gt; 1: gnome-keyring-2.32.1-r6 do_configure (pid 3290)
&gt; 2: libsoup-2.4-2.38.1-r0 do_compile (pid 20229)
&gt; 3: neon-0.29.6-r2 do_configure (pid 20268)
&gt; 4: consolekit-0.4.5-r9 do_compile (pid 22715)
&gt; 5: libglade-2.6.4-r3 do_package (pid 23612)
&gt; NOTE: package libglade-2.6.4-r3: task do_package: Succeeded
&gt; Waiting for 5 running tasks to finish:
&gt; 0: perl-5.14.2-r6 do_compile (pid 2907)
&gt; 1: gnome-keyring-2.32.1-r6 do_configure (pid 3290)
&gt; 2: libsoup-2.4-2.38.1-r0 do_compile (pid 20229)
&gt; 3: neon-0.29.6-r2 do_configure (pid 20268)
&gt; 4: consolekit-0.4.5-r9 do_compile (pid 22715)
&gt; NOTE: package consolekit-0.4.5-r9: task do_compile: Succeeded
&gt; Waiting for 4 running tasks to finish:
&gt; 0: perl-5.14.2-r6 do_compile (pid 2907)
&gt; 1: gnome-keyring-2.32.1-r6 do_configure (pid 3290)
&gt; 2: libsoup-2.4-2.38.1-r0 do_compile (pid 20229)
&gt; 3: neon-0.29.6-r2 do_configure (pid 20268)
&gt; NOTE: package gnome-keyring-2.32.1-r6: task do_configure: Succeeded
&gt; Waiting for 3 running tasks to finish:
&gt; 0: perl-5.14.2-r6 do_compile (pid 2907)
&gt; 1: libsoup-2.4-2.38.1-r0 do_compile (pid 20229)
&gt; 2: neon-0.29.6-r2 do_configure (pid 20268)
&gt; NOTE: package libsoup-2.4-2.38.1-r0: task do_compile: Succeeded
&gt; Waiting for 2 running tasks to finish:
&gt; 0: perl-5.14.2-r6 do_compile (pid 2907)
&gt; 1: neon-0.29.6-r2 do_configure (pid 20268)
&gt; NOTE: package neon-0.29.6-r2: task do_configure: Succeeded
&gt; Waiting for 1 running tasks to finish:
&gt; 0: perl-5.14.2-r6 do_compile (pid 2907)
&gt; NOTE: package perl-5.14.2-r6: task do_compile: Succeeded
&gt; NOTE: Tasks Summary: Attempted 3587 tasks of which 1595 didn&apos;t need to be
&gt; rerun and 1 failed.
&gt; 
&gt; Summary: 1 task failed:
&gt;   /home/alex/git/poky/meta/recipes-kernel/linux/linux-yocto_3.2.bb,
&gt; do_compile_perf
&gt; Summary: There were 14 WARNING messages shown.
&gt; Summary: There was 1 ERROR message shown, returning a non-zero exit code.
&gt; alex@alex-pc:~/git/poky/build$

This is a different problem, and I need to know exactly what input was used in order to reproduce it.</thetext>
  </long_desc><long_desc isprivate="0" >
    <commentid>23701</commentid>
    <comment_count>5</comment_count>
    <who name="Laurentiu Serban">laurentiu.serban</who>
    <bug_when>2012-08-01 09:25:55 +0000</bug_when>
    <thetext>Hello Tom,

The json file content is the following:
{&quot;kernel_choice&quot;:&quot;linux-yocto_3.2&quot;,&quot;use_default_kernel&quot;:&quot;n&quot;,&quot;keyboard&quot;:&quot;y&quot;,&quot;qemuarch&quot;:&quot;i386&quot;,&quot;smp&quot;:&quot;y&quot;,&quot;touchscreen&quot;:&quot;n&quot;,&quot;need_new_kbranch&quot;:&quot;y&quot;,&quot;new_kbranch&quot;:&quot;standard/default/base&quot;}</thetext>
  </long_desc><long_desc isprivate="0" >
    <commentid>23889</commentid>
    <comment_count>6</comment_count>
    <who name="Tom Zanussi">tom.zanussi</who>
    <bug_when>2012-08-08 20:59:13 +0000</bug_when>
    <thetext>http://git.yoctoproject.org/cgit/cgit.cgi/poky-contrib/log/?h=tzanussi/yocto-bsp-master-update</thetext>
  </long_desc><long_desc isprivate="0" >
    <commentid>23890</commentid>
    <comment_count>7</comment_count>
    <who name="Tom Zanussi">tom.zanussi</who>
    <bug_when>2012-08-08 21:04:58 +0000</bug_when>
    <thetext>Patches for this bug have been submitted as part of this patchset [for master]:

http://git.yoctoproject.org/cgit/cgit.cgi/poky-contrib/log/?h=tzanussi/yocto-bsp-master-update

Patches for this bug have been submitted as part of this patchset [for denzil]:

http://git.yoctoproject.org/cgit/cgit.cgi/poky-contrib/log/?h=tzanussi/yocto-bsp-denzil-update

The perf failure shown is actually not a yocto-bsp problem but a problem with the kernel tools, which Bruce Ashfield will be posting a patch for.  The following preliminary patch for this can be found here:

http://git.yoctoproject.org/cgit/cgit.cgi/poky-contrib/log/?h=tzanussi/kern-tools-denzil-update-from-bruce</thetext>
  </long_desc><long_desc isprivate="0" >
    <commentid>24301</commentid>
    <comment_count>8</comment_count>
    <who name="Tom Zanussi">tom.zanussi</who>
    <bug_when>2012-08-21 17:52:50 +0000</bug_when>
    <thetext>*** Bug 2967 has been marked as a duplicate of this bug. ***</thetext>
  </long_desc><long_desc isprivate="0" >
    <commentid>24590</commentid>
    <comment_count>9</comment_count>
    <who name="Laurentiu Serban">laurentiu.serban</who>
    <bug_when>2012-08-29 10:50:29 +0000</bug_when>
    <thetext>Hello Tom,
Related to Yocto BSP creating now there is another failure:

ERROR: Function failed: do_patch (see /home/lserban/work/master/build/tmp/work/myqemux86-poky-linux/linux-yocto-3.2.18+git1+486f7aec824b4127e91ef53228823e996b3696f0_1+7cc31a952f78b8f8e8469eed93c23e9675a8eeb5-r4.0.1/temp/log.do_patch.14566 for further information)
ERROR: Logfile of failure stored in: /home/lserban/work/master/build/tmp/work/myqemux86-poky-linux/linux-yocto-3.2.18+git1+486f7aec824b4127e91ef53228823e996b3696f0_1+7cc31a952f78b8f8e8469eed93c23e9675a8eeb5-r4.0.1/temp/log.do_patch.14566
Log data follows:
| DEBUG: Executing shell function do_patch
| [INFO]: checkpoint is already restored, nothing to do
| warning: could not find (or was already included): features/logbuf/size-normal.scc (/home/lserban/work/master/build/tmp/work/myqemux86-poky-linux/linux-yocto-3.2.18+git1+486f7aec824b4127e91ef53228823e996b3696f0_1+7cc31a952f78b8f8e8469eed93c23e9675a8eeb5-r4.0.1/linux/meta/cfg/scratch/obj/home/lserban/work/master/myjson/recipes-kernel/linux/files)
| [INFO] validating against known patches  (myqemux86-standard-meta)
error: pathspec &apos;standard/default/base/myqemux86&apos; did not match any file(s) known to git.
| ERROR: could not complete git cmd &quot;git checkout standard/default/base/myqemux86&quot;
| ERROR. could not update git tree
| ERROR. Could not apply updates for myqemux86
| ERROR: Function failed: do_patch (see /home/lserban/work/master/build/tmp/work/myqemux86-poky-linux/linux-yocto-3.2.18+git1+486f7aec824b4127e91ef53228823e996b3696f0_1+7cc31a952f78b8f8e8469eed93c23e9675a8eeb5-r4.0.1/temp/log.do_patch.14566 for further information)
ERROR: Task 800 (/home/lserban/work/master/meta/recipes-kernel/linux/linux-yocto_3.2.bb, do_patch) failed with exit code &apos;1&apos;
NOTE: Tasks Summary: Attempted 4435 tasks of which 4373 didn&apos;t need to be rerun and 1 failed.

Summary: 1 task failed:
  /home/lserban/work/master/meta/recipes-kernel/linux/linux-yocto_3.2.bb, do_patch

cat /home/lserban/work/master/build/tmp/work/myqemux86-poky-linux/linux-yocto-3.2.18+git1+486f7aec824b4127e91ef53228823e996b3696f0_1+7cc31a952f78b8f8e8469eed93c23e9675a8eeb5-r4.0.1/temp/log.do_patch.28603

ERROR: Function failed: do_patch (see /home/lserban/work/master/build/tmp/work/myqemux86-poky-linux/linux-yocto-3.2.18+git1+486f7aec824b4127e91ef53228823e996b3696f0_1+7cc31a952f78b8f8e8469eed93c23e9675a8eeb5-r4.0.1/temp/log.do_patch.14566 for further information)
ERROR: Logfile of failure stored in: /home/lserban/work/master/build/tmp/work/myqemux86-poky-linux/linux-yocto-3.2.18+git1+486f7aec824b4127e91ef53228823e996b3696f0_1+7cc31a952f78b8f8e8469eed93c23e9675a8eeb5-r4.0.1/temp/log.do_patch.14566
Log data follows:
| DEBUG: Executing shell function do_patch
| [INFO]: checkpoint is already restored, nothing to do
| warning: could not find (or was already included): features/logbuf/size-normal.scc (/home/lserban/work/master/build/tmp/work/myqemux86-poky-linux/linux-yocto-3.2.18+git1+486f7aec824b4127e91ef53228823e996b3696f0_1+7cc31a952f78b8f8e8469eed93c23e9675a8eeb5-r4.0.1/linux/meta/cfg/scratch/obj/home/lserban/work/master/myjson/recipes-kernel/linux/files)
| [INFO] validating against known patches  (myqemux86-standard-meta)
error: pathspec &apos;standard/default/base/myqemux86&apos; did not match any file(s) known to git.
| ERROR: could not complete git cmd &quot;git checkout standard/default/base/myqemux86&quot;
| ERROR. could not update git tree
| ERROR. Could not apply updates for myqemux86
| ERROR: Function failed: do_patch (see /home/lserban/work/master/build/tmp/work/myqemux86-poky-linux/linux-yocto-3.2.18+git1+486f7aec824b4127e91ef53228823e996b3696f0_1+7cc31a952f78b8f8e8469eed93c23e9675a8eeb5-r4.0.1/temp/log.do_patch.14566 for further information)
ERROR: Task 800 (/home/lserban/work/master/meta/recipes-kernel/linux/linux-yocto_3.2.bb, do_patch) failed with exit code &apos;1&apos;
NOTE: Tasks Summary: Attempted 4435 tasks of which 4373 didn&apos;t need to be rerun and 1 failed.

Summary: 1 task failed:
  /home/lserban/work/master/meta/recipes-kernel/linux/linux-yocto_3.2.bb, do_patch</thetext>
  </long_desc><long_desc isprivate="0" >
    <commentid>24603</commentid>
    <comment_count>10</comment_count>
    <who name="Tom Zanussi">tom.zanussi</who>
    <bug_when>2012-08-29 13:23:12 +0000</bug_when>
    <thetext>The patches have been submitted, but not yet pulled in, so there wouldn&apos;t be any change.  And actually this last problem you mention is covered by an existing bug.

Please wait until the patches have been pulled in and this bug marked as &apos;RESOLVED&apos; before retesting.</thetext>
  </long_desc><long_desc isprivate="0" >
    <commentid>24730</commentid>
    <comment_count>11</comment_count>
    <who name="Tom Zanussi">tom.zanussi</who>
    <bug_when>2012-09-02 15:37:28 +0000</bug_when>
    <thetext>Fixed in poky/master: ba463277ff342a8dc77d9a59c6e879e06a855298</thetext>
  </long_desc><long_desc isprivate="0" >
    <commentid>25120</commentid>
    <comment_count>12</comment_count>
    <who name="Tom Zanussi">tom.zanussi</who>
    <bug_when>2012-09-12 18:26:49 +0000</bug_when>
    <thetext>*** Bug 3079 has been marked as a duplicate of this bug. ***</thetext>
  </long_desc><long_desc isprivate="0" >
    <commentid>25497</commentid>
    <comment_count>13</comment_count>
    <who name="Laurentiu Serban">laurentiu.serban</who>
    <bug_when>2012-09-20 21:20:58 +0000</bug_when>
    <thetext>Verified in 1.3 M4 RC4. This issue is not reproducible anymore</thetext>
  </long_desc>
      
          <attachment
              isobsolete="0"
              ispatch="0"
              isprivate="0"
          >
            <attachid>623</attachid>
            <date>2012-07-04 15:06:47 +0000</date>
            <delta_ts>2012-07-04 15:06:47 +0000</delta_ts>
            <desc>log do patch json</desc>
            <filename>log.do_patch.10463</filename>
            <type>application/octet-stream</type>
            <size>1173</size>
            <attacher name="Laurentiu Serban">laurentiu.serban</attacher>
            
              <data encoding="base64">RVJST1I6IEZ1bmN0aW9uIGZhaWxlZDogZG9fcGF0Y2ggKHNlZSAvaG9tZS9sc2VyYmFuL3dvcmsv
eW9jdG8vYnVpbGQvdG1wL3dvcmsvbXlxZW11eDg2LXBva3ktbGludXgvbGludXgteW9jdG8tMy4y
LjE4K2dpdDErNDlmOTMxYmMyOTRkNWI2YmU2MDUwMmJiZDQ0OGNmZjVhYTc2NjIzNV8xKzhiOGNm
YWFhYjJiOGQ3OWFjNTZlOGM5YTg1YmFkOWFlN2JjYTM5OWMtcjEuMS90ZW1wL2xvZy5kb19wYXRj
aC4xMDQ2MyBmb3IgZnVydGhlciBpbmZvcm1hdGlvbikKY2hlY2twb2ludCBpcyBhbHJlYWR5IHJl
c3RvcmVkLCBub3RoaW5nIHRvIGRvCmVycm9yOiAncmVmcy9oZWFkcy9zdGFuZGFyZC9kZWZhdWx0
L2Jhc2UnIGV4aXN0czsgY2Fubm90IGNyZWF0ZSAncmVmcy9oZWFkcy9zdGFuZGFyZC9kZWZhdWx0
L2Jhc2UvbXlxZW11eDg2JwpmYXRhbDogRmFpbGVkIHRvIGxvY2sgcmVmIGZvciB1cGRhdGU6IE5v
dCBhIGRpcmVjdG9yeQp3YXJuaW5nOiBjb3VsZCBub3QgZmluZCAob3Igd2FzIGFscmVhZHkgaW5j
bHVkZWQpOiBmZWF0dXJlcy9sb2didWYvc2l6ZS1ub3JtYWwuc2NjCndhcm5pbmc6IGNvdWxkIG5v
dCBmaW5kIChvciB3YXMgYWxyZWFkeSBpbmNsdWRlZCk6IHVzZXItcGF0Y2hlcy5zY2MKW0lORk9d
IHZhbGlkYXRpbmcgYWdhaW5zdCBrbm93biBwYXRjaGVzICAobXlxZW11eDg2LWJhc2UtbWV0YSkK
ZXJyb3I6IFlvdXIgbG9jYWwgY2hhbmdlcyB0byB0aGUgZm9sbG93aW5nIGZpbGVzIHdvdWxkIGJl
IG92ZXJ3cml0dGVuIGJ5IGNoZWNrb3V0OgoJTWFrZWZpbGUKCWRyaXZlcnMvdHR5L3NlcmlhbC9w
Y2hfdWFydC5jCglkcml2ZXJzL3VzYi9ob3N0L3BjaS1xdWlya3MuYwoJZnMvbmFtZWkuYwoJZnMv
bmZzL3N1cGVyLmMKCWZzL3NwbGljZS5jCglpbmNsdWRlL2xpbnV4L25mc194ZHIuaAoJa2VybmVs
L3RpbWUvbnRwLmMKCW5ldC9pcHY0L2FycC5jCglzY3JpcHRzL21vZC9tb2Rwb3N0LmMKUGxlYXNl
LCBjb21taXQgeW91ciBjaGFuZ2VzIG9yIHN0YXNoIHRoZW0gYmVmb3JlIHlvdSBjYW4gc3dpdGNo
IGJyYW5jaGVzLgpBYm9ydGluZwpFUlJPUjogY291bGQgbm90IGNoZWNrb3V0IGJyYW5jaCBiYXNl
CkVSUk9SLiBjb3VsZCBub3QgdXBkYXRlIGdpdCB0cmVlCkVSUk9SLiBDb3VsZCBub3QgbW9kaWZ5
IHN0YW5kYXJkL2RlZmF1bHQvYmFzZS9teXFlbXV4ODYK
</data>

          </attachment>
      

    </bug>

</bugzilla>