<?xml version="1.0" encoding="UTF-8" standalone="yes" ?>
<!DOCTYPE bugzilla SYSTEM "https://bugzilla.yoctoproject.org/page.cgi?id=bugzilla.dtd">

<bugzilla version="5.0.6"
          urlbase="https://bugzilla.yoctoproject.org/"
          
          maintainer="it-coreprojects-helpdesk@linuxfoundation.org"
>

    <bug>
          <bug_id>2834</bug_id>
          
          <creation_ts>2012-07-26 07:36:42 +0000</creation_ts>
          <short_desc>libsamplerate0-0.1.8-r0: task do_compile: Failed</short_desc>
          <delta_ts>2012-11-01 16:04:06 +0000</delta_ts>
          <reporter_accessible>1</reporter_accessible>
          <cclist_accessible>1</cclist_accessible>
          <classification_id>7</classification_id>
          <classification>Build System, Metadata &amp; Runtime</classification>
          <product>OE-Core</product>
          <component>multimedia</component>
          <version>unspecified</version>
          <rep_platform>x86</rep_platform>
          <op_sys>Multiple</op_sys>
          <bug_status>VERIFIED</bug_status>
          <resolution>FIXED</resolution>
          
          
          <bug_file_loc></bug_file_loc>
          <status_whiteboard>(autobuilder)</status_whiteboard>
          <keywords></keywords>
          <priority>Medium</priority>
          <bug_severity>normal</bug_severity>
          <target_milestone>1.3 M4</target_milestone>
          
          
          <everconfirmed>1</everconfirmed>
          <reporter name="Nitin Kamble">nitin.a.kamble</reporter>
          <assigned_to name="Cristian Iorga">cristian.iorga</assigned_to>
          <cc>alexandru.c.georgescu</cc>
    
    <cc>alexandrux.palalau</cc>
    
    <cc>jessica.zhang</cc>
    
    <cc>meta.mr.watcher</cc>
    
    <cc>meta.watcher</cc>
    
    <cc>richard.purdie</cc>
    
    <cc>song.liu</cc>
          
          
          <cf_os>---</cf_os>
          <cf_regression_type>---</cf_regression_type>
          
          <cf_docchange>---</cf_docchange>

      

      

      

          <comment_sort_order>oldest_to_newest</comment_sort_order>  
          <long_desc isprivate="0" >
    <commentid>23511</commentid>
    <comment_count>0</comment_count>
    <who name="Nitin Kamble">nitin.a.kamble</who>
    <bug_when>2012-07-26 07:36:42 +0000</bug_when>
    <thetext>i586-poky-linux-gcc  -m32   -march=i586 --sysroot=/srv/home/pokybuild/yocto-autobuilder/yocto-slave/nightly-world/build/build/tmp/sysroots/qemux86 -DHAVE_CONFIG_H -I. -I../src -I./../src     -O2 -pipe -g -feliminate-unused-debug-types -std=gnu99 -W -Wstrict-prototypes -Wmissing-prototypes -Wall -Waggregate-return -Wcast-align -Wcast-qual -Wnested-externs -Wshadow -Wpointer-arith -pipe -c timewarp-file.c
| sndfile-resample.c:30:21: fatal error: sndfile.h: No such file or directory
| compilation terminated.
| varispeed-play.c:31:21: fatal error: sndfile.h: No such file or directorymake[1]: *** [sndfile-resample.o] Error 1
| make[1]: *** Waiting for unfinished jobs....
| 
| compilation terminated.
| audio_out.c:32:21: fatal error: sndfile.h: No such file or directory
| compilation terminated.
| make[1]: *** [varispeed-play.o] Error 1
| make[1]: *** [audio_out.o] Error 1
| timewarp-file.c:30:21: fatal error: sndfile.h: No such file or directory
| compilation terminated.
| make[1]: *** [timewarp-file.o] Error 1
| make[1]: Leaving directory `/srv/home/pokybuild/yocto-autobuilder/yocto-slave/nightly-world/build/build/tmp/work/i586-poky-linux/libsamplerate0-0.1.8-r0/libsamplerate-0.1.8/examples&apos;
| make: *** [all-recursive] Error 1
| ERROR: oe_runmake failed
| ERROR: Function failed: do_compile (see /srv/home/pokybuild/yocto-autobuilder/yocto-slave/nightly-world/build/build/tmp/work/i586-poky-linux/libsamplerate0-0.1.8-r0/temp/log.do_compile.12997 for further information)
NOTE: package libsamplerate0-0.1.8-r0: task do_compile: Failed


Build Configuration:
BB_VERSION        = &quot;1.15.3&quot;
TARGET_ARCH       = &quot;i586&quot;
TARGET_OS         = &quot;linux&quot;
MACHINE           = &quot;qemux86&quot;
DISTRO            = &quot;poky&quot;
DISTRO_VERSION    = &quot;1.2+snapshot-20120725&quot;
TUNE_FEATURES     = &quot;m32 i586&quot;
TARGET_FPU        = &quot;&quot;
meta
meta-yocto        = &quot;master:0ffb02eec2beaea27ff0ec9d3d31b0a09e675a4c&quot;
meta-qt3          = &quot;master:f8475d5c5935695d4d1dfff1d7be30f49e162094&quot;


Autobuilder log: http://autobuilder.yoctoproject.org:8010/builders/nightly-world/builds/190/steps/shell_34/logs/stdio</thetext>
  </long_desc><long_desc isprivate="0" >
    <commentid>23519</commentid>
    <comment_count>1</comment_count>
    <who name="Cristian Iorga">cristian.iorga</who>
    <bug_when>2012-07-26 10:48:16 +0000</bug_when>
    <thetext>I was not able to replicate it.
Did a git pull today, so:
DISTRO_VERSION    = &quot;1.2+snapshot-20120726&quot;.

libsamplerate0 compiled and build cleanly.</thetext>
  </long_desc><long_desc isprivate="0" >
    <commentid>23520</commentid>
    <comment_count>2</comment_count>
    <who name="Nitin Kamble">nitin.a.kamble</who>
    <bug_when>2012-07-26 10:52:36 +0000</bug_when>
    <thetext>in that case it may be dependency issue. probably the recipe sndfile.h is not in the DEPENDS of the libsamplerate</thetext>
  </long_desc><long_desc isprivate="0" >
    <commentid>23521</commentid>
    <comment_count>3</comment_count>
    <who name="Nitin Kamble">nitin.a.kamble</who>
    <bug_when>2012-07-26 10:53:47 +0000</bug_when>
    <thetext>which recipe provides sndfile.h ?
try &quot;bitbake clean&quot;ning that recipe before testing.</thetext>
  </long_desc><long_desc isprivate="0" >
    <commentid>24492</commentid>
    <comment_count>4</comment_count>
    <who name="Alexandru Georgescu">alexandru.c.georgescu</who>
    <bug_when>2012-08-27 10:34:57 +0000</bug_when>
    <thetext>(In reply to comment #3)
&gt; which recipe provides sndfile.h ?
&gt; try &quot;bitbake clean&quot;ning that recipe before testing.

(In reply to comment #1)
&gt; I was not able to replicate it.
&gt; Did a git pull today, so:
&gt; DISTRO_VERSION    = &quot;1.2+snapshot-20120726&quot;.
&gt; 
&gt; libsamplerate0 compiled and build cleanly.

Hi Cristian,
Do you have an update regarding this?

Thanks,
Alex.</thetext>
  </long_desc><long_desc isprivate="0" >
    <commentid>24497</commentid>
    <comment_count>5</comment_count>
    <who name="Cristian Iorga">cristian.iorga</who>
    <bug_when>2012-08-27 14:20:32 +0000</bug_when>
    <thetext>Hello,

Like I said previously, I was not able to replicate it.
If a test case can be provided, I will investigate it.

Regards,
Cristian</thetext>
  </long_desc><long_desc isprivate="0" >
    <commentid>26917</commentid>
    <comment_count>6</comment_count>
    <who name="Richard Purdie">richard.purdie</who>
    <bug_when>2012-10-25 15:18:06 +0000</bug_when>
    <thetext>Fixed in master by http://git.yoctoproject.org/cgit.cgi/poky/commit/?id=c7cadd17ab2f60d0f0560e7eb377675902a7ede0</thetext>
  </long_desc><long_desc isprivate="0" >
    <commentid>27159</commentid>
    <comment_count>7</comment_count>
    <who name="Alexandru Palalau">alexandrux.palalau</who>
    <bug_when>2012-11-01 16:04:06 +0000</bug_when>
    <thetext>Verified on master branch, commit ID:05a1f4a5a32c6cc392fa4480732101d668cd6f77</thetext>
  </long_desc>
      
      

    </bug>

</bugzilla>