<?xml version="1.0" encoding="UTF-8" standalone="yes" ?>
<!DOCTYPE bugzilla SYSTEM "https://bugzilla.yoctoproject.org/page.cgi?id=bugzilla.dtd">

<bugzilla version="5.0.6"
          urlbase="https://bugzilla.yoctoproject.org/"
          
          maintainer="it-coreprojects-helpdesk@linuxfoundation.org"
>

    <bug>
          <bug_id>2911</bug_id>
          
          <creation_ts>2012-08-07 20:53:05 +0000</creation_ts>
          <short_desc>sudoku-savant installation failure when using standalone toolchain</short_desc>
          <delta_ts>2012-08-17 02:56:18 +0000</delta_ts>
          <reporter_accessible>1</reporter_accessible>
          <cclist_accessible>1</cclist_accessible>
          <classification_id>6</classification_id>
          <classification>Yocto Project Subprojects</classification>
          <product>ADT</product>
          <component>adt</component>
          <version>1.3</version>
          <rep_platform>x86</rep_platform>
          <op_sys>Multiple</op_sys>
          <bug_status>RESOLVED</bug_status>
          <resolution>NOTABUG</resolution>
          
          
          <bug_file_loc></bug_file_loc>
          <status_whiteboard></status_whiteboard>
          <keywords></keywords>
          <priority>Undecided</priority>
          <bug_severity>normal</bug_severity>
          <target_milestone>---</target_milestone>
          
          
          <everconfirmed>1</everconfirmed>
          <reporter name="Laurentiu Serban">laurentiu.serban</reporter>
          <assigned_to name="Jessica">jessica.zhang</assigned_to>
          <cc>liang.li2</cc>
    
    <cc>poky.adt.watcher</cc>
    
    <cc>poky.watcher</cc>
          
          
          <cf_os>---</cf_os>
          <cf_regression_type>---</cf_regression_type>
          
          <cf_docchange>---</cf_docchange>

      

      

      

          <comment_sort_order>oldest_to_newest</comment_sort_order>  
          <long_desc isprivate="0" >
    <commentid>23860</commentid>
    <comment_count>0</comment_count>
    <who name="Laurentiu Serban">laurentiu.serban</who>
    <bug_when>2012-08-07 20:53:05 +0000</bug_when>
    <thetext>If the standalone toolchain is used for make install sudoku-savant the following error occurs.
If the ADT installed toolchain is used the error does not occur.

desktop-file-install --vendor= --dir=/usr/local/share/applications sudoku-savant.desktop
Error on file &quot;sudoku-savant.desktop&quot;: Failed to create file &apos;/usr/local/share/applications/sudoku-savant.desktop.PORWIW&apos;: No such file or directory
make[2]: *** [install-data-local] Error 1
make[2]: Leaving directory `/opt/poky/1.2+snapshot/sudoku-savant-1.2.1&apos;
make[1]: *** [install-am] Error 2
make[1]: Leaving directory `/opt/poky/1.2+snapshot/sudoku-savant-1.2.1&apos;
make: *** [install-recursive] Error 1
lserban@lserban-Vostro-460:/opt/poky/1.2+snapshot/sudoku-savant-1.2.1$</thetext>
  </long_desc><long_desc isprivate="0" >
    <commentid>23874</commentid>
    <comment_count>1</comment_count>
    <who name="liang li">liang.li2</who>
    <bug_when>2012-08-08 04:06:34 +0000</bug_when>
    <thetext>using sudoku-savant-1.2.1 and toolchain from nightly build 20120802-1,no such error on ubuntu 12.04 64 bit host after running &quot;sudo make install DESTDDIR=/opt/tmp&quot; .</thetext>
  </long_desc><long_desc isprivate="0" >
    <commentid>23897</commentid>
    <comment_count>2</comment_count>
    <who name="Jessica">jessica.zhang</who>
    <bug_when>2012-08-08 22:43:52 +0000</bug_when>
    <thetext>Per Li&apos;s comments, seems things still working</thetext>
  </long_desc><long_desc isprivate="0" >
    <commentid>24126</commentid>
    <comment_count>3</comment_count>
    <who name="Laurentiu Serban">laurentiu.serban</who>
    <bug_when>2012-08-16 20:48:49 +0000</bug_when>
    <thetext>Hello Liang, could you please try to change the ownership of the directory and rerun the make install command?
Thank you,
Laurentiu</thetext>
  </long_desc><long_desc isprivate="0" >
    <commentid>24131</commentid>
    <comment_count>4</comment_count>
    <who name="liang li">liang.li2</who>
    <bug_when>2012-08-17 02:56:18 +0000</bug_when>
    <thetext>(In reply to comment #3)
&gt; Hello Liang, could you please try to change the ownership of the directory
&gt; and rerun the make install command?
&gt; Thank you,
&gt; Laurentiu

if not use &quot;sudo&quot; and only run &quot;make install&quot;, will get the similar error.
if use &quot;sudo&quot; and run &quot;sudo make install&quot;, will not get the error and &quot;make install&quot; will susccess.</thetext>
  </long_desc>
      
      

    </bug>

</bugzilla>