<?xml version="1.0" encoding="UTF-8" standalone="yes" ?>
<!DOCTYPE bugzilla SYSTEM "https://bugzilla.yoctoproject.org/page.cgi?id=bugzilla.dtd">

<bugzilla version="5.0.6"
          urlbase="https://bugzilla.yoctoproject.org/"
          
          maintainer="it-coreprojects-helpdesk@linuxfoundation.org"
>

    <bug>
          <bug_id>3861</bug_id>
          
          <creation_ts>2013-02-06 21:16:32 +0000</creation_ts>
          <short_desc>arm: ld: cannot find /lib/libpthread.so.0</short_desc>
          <delta_ts>2013-02-06 23:52:25 +0000</delta_ts>
          <reporter_accessible>1</reporter_accessible>
          <cclist_accessible>1</cclist_accessible>
          <classification_id>7</classification_id>
          <classification>Build System, Metadata &amp; Runtime</classification>
          <product>OE-Core</product>
          <component>devtools / tool chain</component>
          <version>1.4</version>
          <rep_platform>x86</rep_platform>
          <op_sys>Multiple</op_sys>
          <bug_status>RESOLVED</bug_status>
          <resolution>DUPLICATE</resolution>
          <dup_id>3667</dup_id>
          
          <bug_file_loc></bug_file_loc>
          <status_whiteboard>autobuilder</status_whiteboard>
          <keywords></keywords>
          <priority>Undecided</priority>
          <bug_severity>normal</bug_severity>
          <target_milestone>---</target_milestone>
          
          
          <everconfirmed>1</everconfirmed>
          <reporter name="Nitin Kamble">nitin.a.kamble</reporter>
          <assigned_to name="Bogdan Marinescu">bogdan.a.marinescu</assigned_to>
          <cc>meta.mr.watcher</cc>
    
    <cc>meta.watcher</cc>
    
    <cc>richard.purdie</cc>
          
          
          <cf_os>---</cf_os>
          <cf_regression_type>---</cf_regression_type>
          
          <cf_docchange>---</cf_docchange>

      

      

      

          <comment_sort_order>oldest_to_newest</comment_sort_order>  
          <long_desc isprivate="0" >
    <commentid>29605</commentid>
    <comment_count>0</comment_count>
    <who name="Nitin Kamble">nitin.a.kamble</who>
    <bug_when>2013-02-06 21:16:32 +0000</bug_when>
    <thetext>ld is not able to find these files: /lib/libpthread.so.0 /usr/lib/libpthread_nonshared.a




Build status: FAILURE
Buildslave for this Build: ab10.i.yoctoproject.org 
Complete logs for all build steps: http://autobuilder.yoctoproject.org:8010/builders/nightly-fsl-arm/builds/66 
Build Reason: Triggerable(nightly-fsl-arm) 
Build Source Stamp: [branch master] 451f2d083d6c05454d2c3366bd09c7fb13fd8e47 
Detailed log of last build step: http://autobuilder.yoctoproject.org:8010/builders/nightly-fsl-arm/builds/66/steps/shell_71/logs/stdio 
Last 20 lines of &quot;shell_71.stdio&quot; Error log:
| arm-poky-linux-gnueabi-libtool: link: /bin/grep -E -e &quot;^ga_&quot; &quot;.libs/libavahi-gobject.exp&quot; &gt; &quot;.libs/libavahi-gobject.expT&quot;
| arm-poky-linux-gnueabi-libtool: link: mv -f &quot;.libs/libavahi-gobject.expT&quot; &quot;.libs/libavahi-gobject.exp&quot;
| arm-poky-linux-gnueabi-libtool: link: echo &quot;{ global:&quot; &gt; .libs/libavahi-gobject.ver
| arm-poky-linux-gnueabi-libtool: link: cat .libs/libavahi-gobject.exp | sed -e &quot;s/\(.*\)/\1;/&quot; &gt;&gt; .libs/libavahi-gobject.ver
| arm-poky-linux-gnueabi-libtool: link: echo &quot;local: *; };&quot; &gt;&gt; .libs/libavahi-gobject.ver
| arm-poky-linux-gnueabi-libtool: link: arm-poky-linux-gnueabi-gcc -march=armv7-a -mthumb-interwork -mfloat-abi=softfp -mfpu=neon --sysroot=/srv/home/pokybuild/yocto-autobuilder/yocto-slave/nightly-fsl-arm/build/build/tmp/sysroots/imx6qsabresd -std=gnu99 -shared -fPIC -DPIC .libs/libavahi_gobject_la-ga-client.o .libs/libavahi_gobject_la-ga-entry-group.o .libs/libavahi_gobject_la-ga-error.o .libs/libavahi_gobject_la-ga-record-browser.o .libs/libavahi_gobject_la-ga-service-browser.o .libs/libavahi_gobject_la-ga-service-resolver.o .libs/libavahi_gobject_la-signals-marshal.o .libs/libavahi_gobject_la-ga-client-enumtypes.o .libs/libavahi_gobject_la-ga-entry-group-enumtypes.o .libs/libavahi_gobject_la-ga-enums-enumtypes.o -L/srv/home/pokybuild/yocto-autobuilder/yocto-slave/nightly-fsl-arm/build/build/tmp/work/armv7a-vfp-neon-poky-linux-gnueabi/avahi/0.6.31-r6.1/avahi-0.6.31/avahi-common/.libs ../avahi-common/.libs/libavahi-common.so ../avahi-client/.libs/libavahi-client.so -L/srv/home/pokybuild/yocto-autobuilder/yocto-slave/nightly-fsl-arm/build/build/tmp/sysroots/imx53qsb/usr/lib /srv/home/pokybuild/yocto-autobuilder/yocto-slave/nightly-fsl-arm/build/build/tmp/sysroots/imx6qsabresd/usr/lib/libdbus-1.so -lrt -ldl ../avahi-glib/.libs/libavahi-glib.so /srv/home/pokybuild/yocto-autobuilder/yocto-slave/nightly-fsl-arm/build/build/tmp/work/armv7a-vfp-neon-poky-linux-gnueabi/avahi/0.6.31-r6.1/avahi-0.6.31/avahi-common/.libs/libavahi-common.so /srv/home/pokybuild/yocto-autobuilder/yocto-slave/nightly-fsl-arm/build/build/tmp/sysroots/imx6qsabresd/usr/lib/libgobject-2.0.so -L/srv/home/pokybuild/yocto-autobuilder/yocto-slave/nightly-fsl-arm/build/build/tmp/sysroots/imx6qsabresd/usr/lib /srv/home/pokybuild/yocto-autobuilder/yocto-slave/nightly-fsl-arm/build/build/tmp/sysroots/imx6qsabresd/usr/lib/libgthread-2.0.so /srv/home/pokybuild/yocto-autobuilder/yocto-slave/nightly-fsl-arm/build/build/tmp/sysroots/imx6qsabresd/usr/lib/libffi.so /srv/home/pokybuild/yocto-autobuilder/yocto-slave/nightly-fsl-arm/build/build/tmp/sysroots/imx6qsabresd/usr/lib/libglib-2.0.so -lpthread -march=armv7-a -mthumb-interwork -mfloat-abi=softfp -mfpu=neon --sysroot=/srv/home/pokybuild/yocto-autobuilder/yocto-slave/nightly-fsl-arm/build/build/tmp/sysroots/imx6qsabresd -O2 -Wl,-O1 -Wl,--hash-style=gnu -Wl,--as-needed -pthread -Wl,-soname -Wl,libavahi-gobject.so.0 -Wl,-version-script -Wl,.libs/libavahi-gobject.ver -o .libs/libavahi-gobject.so.0.0.4
| /srv/home/pokybuild/yocto-autobuilder/yocto-slave/nightly-fsl-arm/build/build/tmp/sysroots/x86_64-linux/usr/libexec/armv7a-vfp-neon-poky-linux-gnueabi/gcc/arm-poky-linux-gnueabi/4.7.2/ld: cannot find /lib/libpthread.so.0
| /srv/home/pokybuild/yocto-autobuilder/yocto-slave/nightly-fsl-arm/build/build/tmp/sysroots/x86_64-linux/usr/libexec/armv7a-vfp-neon-poky-linux-gnueabi/gcc/arm-poky-linux-gnueabi/4.7.2/ld: cannot find /usr/lib/libpthread_nonshared.a
| collect2: error: ld returned 1 exit status
| make[3]: *** [libavahi-gobject.la] Error 1
| make[3]: Leaving directory `/srv/home/pokybuild/yocto-autobuilder/yocto-slave/nightly-fsl-arm/build/build/tmp/work/armv7a-vfp-neon-poky-linux-gnueabi/avahi/0.6.31-r6.1/avahi-0.6.31/avahi-gobject&apos;
| make[2]: *** [all] Error 2
| make[2]: Leaving directory `/srv/home/pokybuild/yocto-autobuilder/yocto-slave/nightly-fsl-arm/build/build/tmp/work/armv7a-vfp-neon-poky-linux-gnueabi/avahi/0.6.31-r6.1/avahi-0.6.31/avahi-gobject&apos;
| make[1]: *** [all-recursive] Error 1
| make[1]: Leaving directory `/srv/home/pokybuild/yocto-autobuilder/yocto-slave/nightly-fsl-arm/build/build/tmp/work/armv7a-vfp-neon-poky-linux-gnueabi/avahi/0.6.31-r6.1/avahi-0.6.31&apos;
| make: *** [all] Error 2
| ERROR: oe_runmake failed
| ERROR: Function failed: do_compile (see /srv/home/pokybuild/yocto-autobuilder/yocto-slave/nightly-fsl-arm/build/build/tmp/work/armv7a-vfp-neon-poky-linux-gnueabi/avahi/0.6.31-r6.1/temp/log.do_compile.10241 for further information)
ERROR: Task 1668 (/srv/home/pokybuild/yocto-autobuilder/yocto-slave/nightly-fsl-arm/build/meta/recipes-connectivity/avahi/avahi_0.6.31.bb, do_compile) failed with exit code &apos;1&apos;
Summary: There were 2 ERROR</thetext>
  </long_desc><long_desc isprivate="0" >
    <commentid>29617</commentid>
    <comment_count>1</comment_count>
    <who name="Richard Purdie">richard.purdie</who>
    <bug_when>2013-02-06 23:52:25 +0000</bug_when>
    <thetext>This is a dup of 3667, same issue.

*** This bug has been marked as a duplicate of bug 3667 ***</thetext>
  </long_desc>
      
      

    </bug>

</bugzilla>