<?xml version="1.0" encoding="UTF-8" standalone="yes" ?>
<!DOCTYPE bugzilla SYSTEM "https://bugzilla.yoctoproject.org/page.cgi?id=bugzilla.dtd">

<bugzilla version="5.0.6"
          urlbase="https://bugzilla.yoctoproject.org/"
          
          maintainer="it-coreprojects-helpdesk@linuxfoundation.org"
>

    <bug>
          <bug_id>3907</bug_id>
          
          <creation_ts>2013-02-19 13:23:09 +0000</creation_ts>
          <short_desc>lttng build fails for fsl-image-test for imx28evk</short_desc>
          <delta_ts>2013-02-28 15:56:09 +0000</delta_ts>
          <reporter_accessible>1</reporter_accessible>
          <cclist_accessible>1</cclist_accessible>
          <classification_id>7</classification_id>
          <classification>Build System, Metadata &amp; Runtime</classification>
          <product>BSPs</product>
          <component>bsps-meta-fsl-arm</component>
          <version>unspecified</version>
          <rep_platform>x86</rep_platform>
          <op_sys>Multiple</op_sys>
          <bug_status>VERIFIED</bug_status>
          <resolution>WORKSFORME</resolution>
          
          
          <bug_file_loc></bug_file_loc>
          <status_whiteboard></status_whiteboard>
          <keywords></keywords>
          <priority>Undecided</priority>
          <bug_severity>normal</bug_severity>
          <target_milestone>---</target_milestone>
          
          
          <everconfirmed>1</everconfirmed>
          <reporter name="Daiane">angolini</reporter>
          <assigned_to name="Otavio Salvador">otavio</assigned_to>
          <cc>corneliux.stoicescu</cc>
          
          
          <cf_os>---</cf_os>
          <cf_regression_type>---</cf_regression_type>
          
          <cf_docchange>---</cf_docchange>

      

      

      

          <comment_sort_order>oldest_to_newest</comment_sort_order>  
          <long_desc isprivate="0" >
    <commentid>29958</commentid>
    <comment_count>0</comment_count>
    <who name="Daiane">angolini</who>
    <bug_when>2013-02-19 13:23:09 +0000</bug_when>
    <thetext>ERROR: Function failed: do_compile (see /home/b19406/master/build_mx28/tmp/work/imx28evk-poky-linux-gnueabi/lttng-modules/2.1.0-r0/temp/log.do_compile.10276 for further information)
ERROR: Logfile of failure stored in: /home/b19406/master/build_mx28/tmp/work/imx28evk-poky-linux-gnueabi/lttng-modules/2.1.0-r0/temp/log.do_compile.10276
Log data follows:
| DEBUG: Executing shell function do_compile
| NOTE: make -j 4 -e MAKEFLAGS= KERNEL_PATH=/home/b19406/master/build_mx28/tmp/sysroots/imx28evk/usr/src/kernel KERNEL_SRC=/home/b19406/master/build_mx28/tmp/sysroots/imx28evk/usr/src/kernel KERNEL_VERSION=3.8.0-rc7 CC=arm-poky-linux-gnueabi-gcc  -march=armv5te  -marm -mthumb-interwork   --sysroot=/home/b19406/master/build_mx28/tmp/sysroots/imx28evk  -mno-thumb-interwork -marm LD=arm-poky-linux-gnueabi-ld --sysroot=/home/b19406/master/build_mx28/tmp/sysroots/imx28evk    AR=arm-poky-linux-gnueabi-ar
| make -C /home/b19406/master/build_mx28/tmp/sysroots/imx28evk/usr/src/kernel M=/home/b19406/master/build_mx28/tmp/work/imx28evk-poky-linux-gnueabi/lttng-modules/2.1.0-r0/git modules
| make[1]: Entering directory `/home/b19406/master/build_mx28/tmp/sysroots/imx28evk/usr/src/kernel&apos;
|   CC [M]  /home/b19406/master/build_mx28/tmp/work/imx28evk-poky-linux-gnueabi/lttng-modules/2.1.0-r0/git/lttng-ring-buffer-client-discard.o
| In file included from include/uapi/linux/kernel.h:4:0,
|                  from include/linux/kernel.h:16,
|                  from include/linux/cache.h:4,
|                  from include/linux/time.h:4,
|                  from include/linux/stat.h:18,
|                  from include/linux/module.h:10,
|                  from /home/b19406/master/build_mx28/tmp/work/imx28evk-poky-linux-gnueabi/lttng-modules/2.1.0-r0/git/lttng-ring-buffer-client-discard.c:23:
| /home/b19406/master/build_mx28/tmp/sysroots/imx28evk/usr/src/kernel/include/uapi/linux/sysinfo.h:8:2: error: unknown type name &apos;__kernel_long_t&apos;
| /home/b19406/master/build_mx28/tmp/sysroots/imx28evk/usr/src/kernel/include/uapi/linux/sysinfo.h:9:2: error: unknown type name &apos;__kernel_ulong_t&apos;
| /home/b19406/master/build_mx28/tmp/sysroots/imx28evk/usr/src/kernel/include/uapi/linux/sysinfo.h:10:2: error: unknown type name &apos;__kernel_ulong_t&apos;
| /home/b19406/master/build_mx28/tmp/sysroots/imx28evk/usr/src/kernel/include/uapi/linux/sysinfo.h:11:2: error: unknown type name &apos;__kernel_ulong_t&apos;
| /home/b19406/master/build_mx28/tmp/sysroots/imx28evk/usr/src/kernel/include/uapi/linux/sysinfo.h:12:2: error: unknown type name &apos;__kernel_ulong_t&apos;
| /home/b19406/master/build_mx28/tmp/sysroots/imx28evk/usr/src/kernel/include/uapi/linux/sysinfo.h:13:2: error: unknown type name &apos;__kernel_ulong_t&apos;
| /home/b19406/master/build_mx28/tmp/sysroots/imx28evk/usr/src/kernel/include/uapi/linux/sysinfo.h:14:2: error: unknown type name &apos;__kernel_ulong_t&apos;
| /home/b19406/master/build_mx28/tmp/sysroots/imx28evk/usr/src/kernel/include/uapi/linux/sysinfo.h:15:2: error: unknown type name &apos;__kernel_ulong_t&apos;
| /home/b19406/master/build_mx28/tmp/sysroots/imx28evk/usr/src/kernel/include/uapi/linux/sysinfo.h:18:2: error: unknown type name &apos;__kernel_ulong_t&apos;
| /home/b19406/master/build_mx28/tmp/sysroots/imx28evk/usr/src/kernel/include/uapi/linux/sysinfo.h:19:2: error: unknown type name &apos;__kernel_ulong_t&apos;
| /home/b19406/master/build_mx28/tmp/sysroots/imx28evk/usr/src/kernel/include/uapi/linux/sysinfo.h:21:22: error: &apos;__kernel_ulong_t&apos; undeclared here (not in a function)
| make[2]: *** [/home/b19406/master/build_mx28/tmp/work/imx28evk-poky-linux-gnueabi/lttng-modules/2.1.0-r0/git/lttng-ring-buffer-client-discard.o] Error 1
| make[1]: *** [_module_/home/b19406/master/build_mx28/tmp/work/imx28evk-poky-linux-gnueabi/lttng-modules/2.1.0-r0/git] Error 2
| make[1]: Leaving directory `/home/b19406/master/build_mx28/tmp/sysroots/imx28evk/usr/src/kernel&apos;
| make: *** [default] Error 2
| ERROR: oe_runmake failed
| ERROR: Function failed: do_compile (see /home/b19406/master/build_mx28/tmp/work/imx28evk-poky-linux-gnueabi/lttng-modules/2.1.0-r0/temp/log.do_compile.10276 for further information)
ERROR: Task 1709 (/home/b19406/master/sources/poky/meta/recipes-kernel/lttng/lttng-modules_2.1.0.bb, do_compile) failed with exit code &apos;1&apos;
NOTE: Tasks Summary: Attempted 3586 tasks of which 3568 didn&apos;t need to be rerun and 1 failed.
Waiting for 0 running tasks to finish:

Summary: 1 task failed:
  /home/b19406/master/sources/poky/meta/recipes-kernel/lttng/lttng-modules_2.1.0.bb, do_compile
Summary: There was 1 ERROR message shown, returning a non-zero exit code.</thetext>
  </long_desc><long_desc isprivate="0" >
    <commentid>30232</commentid>
    <comment_count>1</comment_count>
    <who name="Stoicescu Cornel">corneliux.stoicescu</who>
    <bug_when>2013-02-28 10:36:01 +0000</bug_when>
    <thetext>Hello Daiane,

Can you please supply some information about:
-poky version/branch+commit you used

From your log I see you are using master but it would be nice to confirm.

Thanks!</thetext>
  </long_desc><long_desc isprivate="0" >
    <commentid>30254</commentid>
    <comment_count>2</comment_count>
    <who name="Daiane">angolini</who>
    <bug_when>2013-02-28 14:20:26 +0000</bug_when>
    <thetext>I just re-tested it and the bug is gone.

I was not able to reproduce the same error.

Thanks a lot for your attention!</thetext>
  </long_desc><long_desc isprivate="0" >
    <commentid>30255</commentid>
    <comment_count>3</comment_count>
    <who name="Daiane">angolini</who>
    <bug_when>2013-02-28 14:21:23 +0000</bug_when>
    <thetext>I just re-tested it and the bug is gone.

I was not able to reproduce the same error.

Thanks a lot for your attention!</thetext>
  </long_desc><long_desc isprivate="0" >
    <commentid>30256</commentid>
    <comment_count>4</comment_count>
    <who name="Daiane">angolini</who>
    <bug_when>2013-02-28 14:24:09 +0000</bug_when>
    <thetext>I mean, I just re-tested TODAY after a sync I made TODAY

Only to be fully informative regarding the time ;-)</thetext>
  </long_desc><long_desc isprivate="0" >
    <commentid>30261</commentid>
    <comment_count>5</comment_count>
    <who name="Stoicescu Cornel">corneliux.stoicescu</who>
    <bug_when>2013-02-28 15:56:09 +0000</bug_when>
    <thetext>Verified as per above comment.</thetext>
  </long_desc>
      
      

    </bug>

</bugzilla>