<?xml version="1.0" encoding="UTF-8" standalone="yes" ?>
<!DOCTYPE bugzilla SYSTEM "https://bugzilla.yoctoproject.org/page.cgi?id=bugzilla.dtd">

<bugzilla version="5.0.6"
          urlbase="https://bugzilla.yoctoproject.org/"
          
          maintainer="it-coreprojects-helpdesk@linuxfoundation.org"
>

    <bug>
          <bug_id>3977</bug_id>
          
          <creation_ts>2013-03-04 15:16:28 +0000</creation_ts>
          <short_desc>[Test Case 169] Bitbake remake/remake-native check</short_desc>
          <delta_ts>2013-04-30 12:01:51 +0000</delta_ts>
          <reporter_accessible>1</reporter_accessible>
          <cclist_accessible>1</cclist_accessible>
          <classification_id>7</classification_id>
          <classification>Build System, Metadata &amp; Runtime</classification>
          <product>OE-Core</product>
          <component>devtools / tool chain</component>
          <version>1.3</version>
          <rep_platform>x86</rep_platform>
          <op_sys>Multiple</op_sys>
          <bug_status>RESOLVED</bug_status>
          <resolution>FIXED</resolution>
          
          
          <bug_file_loc></bug_file_loc>
          <status_whiteboard></status_whiteboard>
          <keywords></keywords>
          <priority>Medium</priority>
          <bug_severity>normal</bug_severity>
          <target_milestone>1.3.2</target_milestone>
          
          
          <everconfirmed>1</everconfirmed>
          <reporter name="Stoicescu Cornel">corneliux.stoicescu</reporter>
          <assigned_to name="Ross Burton">ross.burton</assigned_to>
          <cc>jessica.zhang</cc>
    
    <cc>meta.mr.watcher</cc>
    
    <cc>meta.watcher</cc>
    
    <cc>poky.bs.watcher</cc>
    
    <cc>poky.watcher</cc>
    
    <cc>richard.purdie</cc>
    
    <cc>sgw</cc>
          
          
          <cf_os>---</cf_os>
          <cf_regression_type>---</cf_regression_type>
          
          <cf_docchange>---</cf_docchange>

      

      

      

          <comment_sort_order>oldest_to_newest</comment_sort_order>  
          <long_desc isprivate="0" >
    <commentid>30405</commentid>
    <comment_count>0</comment_count>
    <who name="Stoicescu Cornel">corneliux.stoicescu</who>
    <bug_when>2013-03-04 15:16:28 +0000</bug_when>
    <thetext>STATUS: FAILED
BUILD: danny:98292d1ef1cb44cf96f0a28fbca6439eda55ce1b
ENVIRONMENT: Ubuntu 12.04 x86_64
STEPS TO REPRODUCE: 1.Set build enverionment.
2.Run &quot;bitbake remake&quot;.
3.Run &quot;bitbake remake-native&quot;

EXPECTED OUTCOME: Both recipes could be successfully built.

Actual outcome:

ERROR: Function failed: do_compile (see /home/cornel/work/poky/build/tmp/work/x86_64-poky-linux/remake-git-r0/temp/log.do_compile.7027 for further information)
ERROR: Logfile of failure stored in: /home/cornel/work/poky/build/tmp/work/x86_64-poky-linux/remake-git-r0/temp/log.do_compile.7027
Log data follows:
| DEBUG: SITE files [&apos;endian-little&apos;, &apos;common-linux&apos;, &apos;common-glibc&apos;, &apos;bit-64&apos;, &apos;x86_64-linux&apos;, &apos;common&apos;]
| DEBUG: Executing shell function do_compile
| [ -d &quot;po&quot; ] &amp;&amp; make do-po-update
| make[1]: Entering directory `/home/cornel/work/poky/build/tmp/work/x86_64-poky-linux/remake-git-r0/git&apos;
| tmppo=&quot;/tmp/po-remake-3.82+dbg0.9dev.$$&quot; \
|   &amp;&amp; rm -rf &quot;$tmppo&quot; \
|   &amp;&amp; mkdir &quot;$tmppo&quot; \
|   &amp;&amp; (cd &quot;$tmppo&quot; \
|       &amp;&amp; wget --passive-ftp -nv --recursive --level=1 --no-directories --no-parent --no-check-certificate -A &apos;*.po&apos; http://translationproject.org/latest/make) \
|   &amp;&amp; cp &quot;$tmppo&quot;/*.po ./po &amp;&amp; rm -rf &quot;$tmppo&quot;
| make[1]: *** [do-po-update] Error 4
| make[1]: Leaving directory `/home/cornel/work/poky/build/tmp/work/x86_64-poky-linux/remake-git-r0/git&apos;
| make: *** [po-update] Error 2
| ERROR: Function failed: do_compile (see /home/cornel/work/poky/build/tmp/work/x86_64-poky-linux/remake-git-r0/temp/log.do_compile.7027 for further information)
ERROR: Task 6 (/home/cornel/work/poky/meta/recipes-devtools/remake/remake_git.bb, do_compile) failed with exit code &apos;1&apos;
NOTE: Tasks Summary: Attempted 832 tasks of which 190 didn&apos;t need to be rerun and 1 failed.
No currently running tasks (832 of 838)

Summary: 1 task failed:
  /home/cornel/work/poky/meta/recipes-devtools/remake/remake_git.bb, do_compile
Summary: There was 1 ERROR message shown, returning a non-zero exit code.


NOTE: This bug is fixed in master: bug 3745</thetext>
  </long_desc><long_desc isprivate="0" >
    <commentid>30408</commentid>
    <comment_count>1</comment_count>
    <who name="Ross Burton">ross.burton</who>
    <bug_when>2013-03-04 16:01:37 +0000</bug_when>
    <thetext>Cherry-picked to danny-next, will be in 1.3.2.</thetext>
  </long_desc><long_desc isprivate="0" >
    <commentid>32766</commentid>
    <comment_count>2</comment_count>
    <who name="Ross Burton">ross.burton</who>
    <bug_when>2013-04-30 12:01:51 +0000</bug_when>
    <thetext>Merged to danny.</thetext>
  </long_desc>
      
      

    </bug>

</bugzilla>