<?xml version="1.0" encoding="UTF-8" standalone="yes" ?>
<!DOCTYPE bugzilla SYSTEM "https://bugzilla.yoctoproject.org/page.cgi?id=bugzilla.dtd">

<bugzilla version="5.0.6"
          urlbase="https://bugzilla.yoctoproject.org/"
          
          maintainer="it-coreprojects-helpdesk@linuxfoundation.org"
>

    <bug>
          <bug_id>4199</bug_id>
          
          <creation_ts>2013-04-04 14:44:00 +0000</creation_ts>
          <short_desc>[Autobuilder] jpeg_8d fails to build on x86_64/nightly-multilib</short_desc>
          <delta_ts>2013-04-30 11:27:30 +0000</delta_ts>
          <reporter_accessible>1</reporter_accessible>
          <cclist_accessible>1</cclist_accessible>
          <classification_id>7</classification_id>
          <classification>Build System, Metadata &amp; Runtime</classification>
          <product>OE-Core</product>
          <component>core</component>
          <version>1.3.1</version>
          <rep_platform>x86</rep_platform>
          <op_sys>Multiple</op_sys>
          <bug_status>RESOLVED</bug_status>
          <resolution>FIXED</resolution>
          
          
          <bug_file_loc></bug_file_loc>
          <status_whiteboard></status_whiteboard>
          <keywords></keywords>
          <priority>Medium</priority>
          <bug_severity>normal</bug_severity>
          <target_milestone>1.3.2</target_milestone>
          
          
          <everconfirmed>1</everconfirmed>
          <reporter name="Bogdan Marinescu">bogdan.a.marinescu</reporter>
          <assigned_to name="Ross Burton">ross.burton</assigned_to>
          <cc>meta.mr.watcher</cc>
    
    <cc>meta.watcher</cc>
    
    <cc>richard.purdie</cc>
          
          
          <cf_os>---</cf_os>
          <cf_regression_type>---</cf_regression_type>
          
          <cf_docchange>---</cf_docchange>

      

      

      

          <comment_sort_order>oldest_to_newest</comment_sort_order>  
          <long_desc isprivate="0" >
    <commentid>31528</commentid>
    <comment_count>0</comment_count>
    <who name="Bogdan Marinescu">bogdan.a.marinescu</who>
    <bug_when>2013-04-04 14:44:00 +0000</bug_when>
    <thetext>http://autobuilder.yoctoproject.org:8011/builders/nightly-multilib/builds/87/steps/Building%20Images_1/logs/stdio

| x86_64-poky-linux-libtool: compile: Failed to create `.libs&apos;
| make[1]: *** [jcmarker.lo] Error 1
| /srv/home/pokybuild/yocto-autobuilder-new/yocto-slave/nightly-multilib/build/build/tmp/sysroots/qemux86-64/usr/bin/crossscripts/x86_64-poky-linux-libtool: line 981: /usr/bin/sed: No such file or directory
| x86_64-poky-linux-libtool: compile: Failed to create `.libs&apos;
| /srv/home/pokybuild/yocto-autobuilder-new/yocto-slave/nightly-multilib/build/build/tmp/sysroots/qemux86-64/usr/bin/crossscripts/x86_64-poky-linux-libtool: line 981: /usr/bin/sed: No such file or directory
| make[1]: *** [jcmainct.lo] Error 1
| x86_64-poky-linux-libtool: compile: Failed to create `.libs&apos;
| make[1]: *** [jcmaster.lo] Error 1
| /srv/home/pokybuild/yocto-autobuilder-new/yocto-slave/nightly-multilib/build/build/tmp/sysroots/qemux86-64/usr/bin/crossscripts/x86_64-poky-linux-libtool: line 981: /usr/bin/sed: No such file or directory
| x86_64-poky-linux-libtool: compile: Failed to create `.libs&apos;
| make[1]: *** [jcinit.lo] Error 1
| /srv/home/pokybuild/yocto-autobuilder-new/yocto-slave/nightly-multilib/build/build/tmp/sysroots/qemux86-64/usr/bin/crossscripts/x86_64-poky-linux-libtool: line 981: /usr/bin/sed: No such file or directory
| x86_64-poky-linux-libtool: compile: Failed to create `.libs&apos;
| make[1]: *** [jcomapi.lo] Error 1
| make[1]: Leaving directory `/srv/home/pokybuild/yocto-autobuilder-new/yocto-slave/nightly-multilib/build/build/tmp/work/x86_64-poky-linux/jpeg-8d-r1/jpeg-8d&apos;
| make: *** [all] Error 2
| ERROR: oe_runmake failed
| ERROR: Function failed: do_compile (see /srv/home/pokybuild/yocto-autobuilder-new/yocto-slave/nightly-multilib/build/build/tmp/work/x86_64-poky-linux/jpeg-8d-r1/temp/log.do_compile.17980 for further information)
ERROR: Task 3739 (/srv/home/pokybuild/yocto-autobuilder-new/yocto-slave/nightly-multilib/build/meta/recipes-core/jpeg/jpeg_8d.bb, do_compile) failed with exit code &apos;1&apos;
Summary: There was 1 ERROR message shown, returning a non-zero exit code.</thetext>
  </long_desc><long_desc isprivate="0" >
    <commentid>31538</commentid>
    <comment_count>1</comment_count>
    <who name="Saul Wold">sgw</who>
    <bug_when>2013-04-04 15:06:54 +0000</bug_when>
    <thetext>Relocation issue, because of sed being hardcoded in libtools</thetext>
  </long_desc><long_desc isprivate="0" >
    <commentid>31539</commentid>
    <comment_count>2</comment_count>
    <who name="Richard Purdie">richard.purdie</who>
    <bug_when>2013-04-04 15:07:11 +0000</bug_when>
    <thetext>Likley fixed with http://git.yoctoproject.org/cgit.cgi/poky/commit/?id=80d0081d42f579d5ea7fab43bce6f6a54d96934a</thetext>
  </long_desc><long_desc isprivate="0" >
    <commentid>31540</commentid>
    <comment_count>3</comment_count>
    <who name="Richard Purdie">richard.purdie</who>
    <bug_when>2013-04-04 15:08:19 +0000</bug_when>
    <thetext>Actually, probably http://git.yoctoproject.org/cgit.cgi/poky/commit/?id=bf3b8506a1c864f7547f08d87386f88ed700ed14</thetext>
  </long_desc><long_desc isprivate="0" >
    <commentid>31544</commentid>
    <comment_count>4</comment_count>
    <who name="Ross Burton">ross.burton</who>
    <bug_when>2013-04-04 15:56:23 +0000</bug_when>
    <thetext>Merged to my danny-next.</thetext>
  </long_desc><long_desc isprivate="0" >
    <commentid>32762</commentid>
    <comment_count>5</comment_count>
    <who name="Ross Burton">ross.burton</who>
    <bug_when>2013-04-30 11:27:30 +0000</bug_when>
    <thetext>Integrated into danny.</thetext>
  </long_desc>
      
      

    </bug>

</bugzilla>