<?xml version="1.0" encoding="UTF-8" standalone="yes" ?>
<!DOCTYPE bugzilla SYSTEM "https://bugzilla.yoctoproject.org/page.cgi?id=bugzilla.dtd">

<bugzilla version="5.0.6"
          urlbase="https://bugzilla.yoctoproject.org/"
          
          maintainer="it-coreprojects-helpdesk@linuxfoundation.org"
>

    <bug>
          <bug_id>4871</bug_id>
          
          <creation_ts>2013-07-19 05:56:06 +0000</creation_ts>
          <short_desc>nss-native:do_compile failed with gcc version 4.1.2 on x86</short_desc>
          <delta_ts>2013-07-22 20:20:53 +0000</delta_ts>
          <reporter_accessible>1</reporter_accessible>
          <cclist_accessible>1</cclist_accessible>
          <classification_id>7</classification_id>
          <classification>Build System, Metadata &amp; Runtime</classification>
          <product>OE-Core</product>
          <component>core</component>
          <version>1.5</version>
          <rep_platform>x86</rep_platform>
          <op_sys>Multiple</op_sys>
          <bug_status>RESOLVED</bug_status>
          <resolution>WONTFIX</resolution>
          
          
          <bug_file_loc></bug_file_loc>
          <status_whiteboard></status_whiteboard>
          <keywords></keywords>
          <priority>Undecided</priority>
          <bug_severity>normal</bug_severity>
          <target_milestone>---</target_milestone>
          
          
          <everconfirmed>1</everconfirmed>
          <reporter name="Chunrong Guo">b40290</reporter>
          <assigned_to name="Saul Wold">sgw</assigned_to>
          <cc>meta.mr.watcher</cc>
    
    <cc>meta.watcher</cc>
          
          
          <cf_os>---</cf_os>
          <cf_regression_type>---</cf_regression_type>
          
          <cf_docchange>---</cf_docchange>

      

      

      

          <comment_sort_order>oldest_to_newest</comment_sort_order>  
          <long_desc isprivate="0" >
    <commentid>34691</commentid>
    <comment_count>0</comment_count>
    <who name="Chunrong Guo">b40290</who>
    <bug_when>2013-07-19 05:56:06 +0000</bug_when>
    <thetext>branch:master
poky :31e6eee860b5f9f4ac9ef0889bcff5648de6e3f9

Test Env: 
CentOS release 5.9 (Final)
Linux 2.6.18-348.12.1.el5.centos.plus
gcc (GCC) 4.1.2 20080704 (Red Hat 4.1.2-54)

$ source  ./oe-init-build-env 
$ bitbake nss 

the below error log:
intel-gcm.s: Assembler messages:
intel-gcm.s:39: Error: no such instruction: `vmovdqu (Tp),T&apos;
intel-gcm.s:40: Error: no such instruction: `vpshufb .Lbswap_mask(%rip),T,T&apos;
intel-gcm.s:41: Error: no such instruction: `vpxor TMP0,TMP0,TMP0&apos;
intel-gcm.s:44: Error: no such instruction: `vpinsrq $0,Mlen,TMP0,TMP0&apos;
intel-gcm.s:45: Error: no such instruction: `vpinsrq $1,Alen,TMP0,TMP0&apos;
intel-gcm.s:46: Error: no such instruction: `vpxor TMP0,T,T&apos;
.......................................
make[3]: *** [Linux3.4_x86_64_glibc_PTH_64_OPT.OBJ/Linux_SINGLE_SHLIB/intel-gcm.o] Error 1
make[3]: Leaving directory `/home/b19537/jenkins/reports/poky/build/tmp/work/x86_64-linux/nss-native/3.15.1-r0/nss-3.15.1/nss/lib/freebl&apos;
make[2]: *** [libs] Error 2
make[2]: Leaving directory `/home/b19537/jenkins/reports/poky/build/tmp/work/x86_64-linux/nss-native/3.15.1-r0/nss-3.15.1/nss/lib/freebl&apos;
make[1]: *** [libs] Error 2
make[1]: Leaving directory `/home/b19537/jenkins/reports/poky/build/tmp/work/x86_64-linux/nss-native/3.15.1-r0/nss-3.15.1/nss/lib&apos;
make: *** [libs] Error 2
make: Leaving directory `/home/b19537/jenkins/reports/poky/build/tmp/work/x86_64-linux/nss-native/3.15.1-r0/nss-3.15.1/nss&apos;
ERROR: Function failed: do_compile (log file is located at /home/b19537/jenkins/reports/poky/build/tmp/work/x86_64-linux/nss-native/3.15.1-r0/temp/log.do_compile.26351</thetext>
  </long_desc><long_desc isprivate="0" >
    <commentid>34767</commentid>
    <comment_count>1</comment_count>
    <who name="Saul Wold">sgw</who>
    <bug_when>2013-07-22 20:20:53 +0000</bug_when>
    <thetext>This version of CentOS and GCC is not tested, nor directly supported by core at this time, if want to support this, we would gladly accept patches. We can reopen this bug and assign it back to you.</thetext>
  </long_desc>
      
      

    </bug>

</bugzilla>