<?xml version="1.0" encoding="UTF-8" standalone="yes" ?>
<!DOCTYPE bugzilla SYSTEM "https://bugzilla.yoctoproject.org/page.cgi?id=bugzilla.dtd">

<bugzilla version="5.0.6"
          urlbase="https://bugzilla.yoctoproject.org/"
          
          maintainer="it-coreprojects-helpdesk@linuxfoundation.org"
>

    <bug>
          <bug_id>4891</bug_id>
          
          <creation_ts>2013-07-22 16:30:33 +0000</creation_ts>
          <short_desc>gcc/gpp compile test fails occur during core-image-sato-sdk on nightly-ppc sanity testing</short_desc>
          <delta_ts>2013-07-22 20:14:04 +0000</delta_ts>
          <reporter_accessible>1</reporter_accessible>
          <cclist_accessible>1</cclist_accessible>
          <classification_id>10</classification_id>
          <classification>QA/Testing</classification>
          <product>Build Testing</product>
          <component>general</component>
          <version>unspecified</version>
          <rep_platform>x86</rep_platform>
          <op_sys>Multiple</op_sys>
          <bug_status>RESOLVED</bug_status>
          <resolution>DUPLICATE</resolution>
          <dup_id>4854</dup_id>
          
          <bug_file_loc></bug_file_loc>
          <status_whiteboard></status_whiteboard>
          <keywords></keywords>
          <priority>Undecided</priority>
          <bug_severity>normal</bug_severity>
          <target_milestone>---</target_milestone>
          
          
          <everconfirmed>1</everconfirmed>
          <reporter name="Beth Flanagan">elizabeth.flanagan</reporter>
          <assigned_to name="Alexandru Georgescu">alexandru.c.georgescu</assigned_to>
          <cc>sgw</cc>
          
          
          <cf_os>---</cf_os>
          <cf_regression_type>---</cf_regression_type>
          
          <cf_docchange>---</cf_docchange>

      

      

      

          <comment_sort_order>oldest_to_newest</comment_sort_order>  
          <long_desc isprivate="0" >
    <commentid>34756</commentid>
    <comment_count>0</comment_count>
    <who name="Beth Flanagan">elizabeth.flanagan</who>
    <bug_when>2013-07-22 16:30:33 +0000</bug_when>
    <thetext>From:
http://autobuilder.yoctoproject.org:8011/builders/nightly-ppc/builds/220/steps/Running%20Sanity%20Tests/logs/stdio

| ======================================================================
| FAIL: test_gcc_compile (oeqa.runtime.gcc.GccCompileTest)
| ----------------------------------------------------------------------
| Traceback (most recent call last):
|   File &quot;/srv/home/pokybuild/yocto-autobuilder-new/yocto-slave/nightly-ppc/build/meta/lib/oeqa/runtime/gcc.py&quot;, line 22, in test_gcc_compile
|     self.assertEqual(status, 0, msg=&quot;running compiled file failed, output %s&quot; % output)
| AssertionError: running compiled file failed, output convert: 10 =&gt; 10.000000
| floorf(1234.670000) = 1235.000000
| 
| ======================================================================
| FAIL: test_gpp_compile (oeqa.runtime.gcc.GccCompileTest)
| ----------------------------------------------------------------------
| Traceback (most recent call last):
|   File &quot;/srv/home/pokybuild/yocto-autobuilder-new/yocto-slave/nightly-ppc/build/meta/lib/oeqa/runtime/gcc.py&quot;, line 28, in test_gpp_compile
|     self.assertEqual(status, 0, msg=&quot;running compiled file failed, output %s&quot; % output)
| AssertionError: running compiled file failed, output convert: 10 =&gt; 10.000000
| floorf(1234.670000) = 1235.000000
| 
| ----------------------------------------------------------------------
| Ran 20 tests in 284.762s
| 
| FAILED (failures=2)
| DEBUG: Python function do_testimage finished
| ERROR: Function failed: Some tests failed. You should check the task log and the ssh log. (ssh log is /srv/home/pokybuild/yocto-autobuilder-new/yocto-slave/nightly-ppc/build/build/tmp/work/qemuppc-poky-linux/core-image-sato-sdk/1.0-r0/testimage/ssh_target_log.20130721180316</thetext>
  </long_desc><long_desc isprivate="0" >
    <commentid>34765</commentid>
    <comment_count>1</comment_count>
    <who name="Saul Wold">sgw</who>
    <bug_when>2013-07-22 20:14:04 +0000</bug_when>
    <thetext>This is a dup of the floor() issue

*** This bug has been marked as a duplicate of bug 4854 ***</thetext>
  </long_desc>
      
      

    </bug>

</bugzilla>