<?xml version="1.0" encoding="UTF-8" standalone="yes" ?>
<!DOCTYPE bugzilla SYSTEM "https://bugzilla.yoctoproject.org/page.cgi?id=bugzilla.dtd">

<bugzilla version="5.0.6"
          urlbase="https://bugzilla.yoctoproject.org/"
          
          maintainer="it-coreprojects-helpdesk@linuxfoundation.org"
>

    <bug>
          <bug_id>4953</bug_id>
          
          <creation_ts>2013-07-30 05:59:09 +0000</creation_ts>
          <short_desc>[Test Case 207] sudoku-savant project compile in sdk image</short_desc>
          <delta_ts>2013-10-25 14:36:16 +0000</delta_ts>
          <reporter_accessible>1</reporter_accessible>
          <cclist_accessible>1</cclist_accessible>
          <classification_id>6</classification_id>
          <classification>Yocto Project Subprojects</classification>
          <product>ADT</product>
          <component>adt</component>
          <version>1.5</version>
          <rep_platform>x86</rep_platform>
          <op_sys>x86_64</op_sys>
          <bug_status>VERIFIED</bug_status>
          <resolution>WORKSFORME</resolution>
          
          
          <bug_file_loc></bug_file_loc>
          <status_whiteboard></status_whiteboard>
          <keywords></keywords>
          <priority>Medium</priority>
          <bug_severity>normal</bug_severity>
          <target_milestone>1.5</target_milestone>
          
          
          <everconfirmed>1</everconfirmed>
          <reporter name="Chandrak">chandrak</reporter>
          <assigned_to name="Laurentiu Palcu">laurentiu.palcu</assigned_to>
          <cc>corneliux.stoicescu</cc>
    
    <cc>poky.adt.watcher</cc>
    
    <cc>poky.watcher</cc>
          
          
          <cf_os>---</cf_os>
          <cf_regression_type>---</cf_regression_type>
          
          <cf_docchange>Don&apos;t know</cf_docchange>

      

      

      

          <comment_sort_order>oldest_to_newest</comment_sort_order>  
          <long_desc isprivate="0" >
    <commentid>35144</commentid>
    <comment_count>0</comment_count>
    <who name="Chandrak">chandrak</who>
    <bug_when>2013-07-30 05:59:09 +0000</bug_when>
    <thetext>STATUS: FAILED
BUILD: master: 67864ca79da08df752487a3a4e1a975546da123d
ENVIRONMENT: qemux86-64
STEPS TO REPRODUCE: 1. Download sudoku-savant project from http://downloads.sourceforge.net/project/sudoku-savant/sudoku-savant/sudoku-savant-1.3/sudoku-savant-1.3.tar.bz2
2. Copy sudoku-savant tarball into sdk image
3. Extract the tarball and do &quot;configure&quot;, &quot;make&quot;

EXPECTED OUTCOME: sudoku-savant could be compiled successfully .


Console Logs: ------- new bug.. not duplicate of 4812 due to different error logs messages of make.

root@qemux86-64:/opt/build_testtools/sudoku/sudoku-savant-1.3# make
make  all-recursive
make[1]: Entering directory `/opt/build_testtools/sudoku/sudoku-savant-1.3&apos;
Making all in src
make[2]: Entering directory `/opt/build_testtools/sudoku/sudoku-savant-1.3/src&apos;
g++ -DHAVE_CONFIG_H -I. -I.. -DPACKAGE_DATA_DIR=\&quot;&quot;/usr/local/share&quot;\&quot; -DPACKAGE_LOCALE_DIR=\&quot;&quot;/usr/local/share/locale&quot;\&quot; -pthread -I/usr/include/gtk-2.0 -I/usr/lib/gtk-2.0/include -I/usr/include/pango-1.0 -I/usr/include/atk-1.0 -I/usr/include/cairo -I/usr/include/pixman-1 -I/usr/include/libpng16 -I/usr/include/gdk-pixbuf-2.0 -I/usr/include/libpng16 -I/usr/include/pango-1.0 -I/usr/include/harfbuzz -I/usr/include/pango-1.0 -I/usr/include/glib-2.0 -I/usr/lib/glib-2.0/include -I/usr/include/freetype2    -frepo -fno-implement-inlines -ansi -pedantic -pipe -Wall -Winline -Wshadow -Wsign-compare -Woverloaded-virtual -Wextra --param max-inline-insns-single=400 -g -O2 -MT main.o -MD -MP -MF .deps/main.Tpo -c -o main.o main.cpp
mv -f .deps/main.Tpo .deps/main.Po
g++ -DHAVE_CONFIG_H -I. -I.. -DPACKAGE_DATA_DIR=\&quot;&quot;/usr/local/share&quot;\&quot; -DPACKAGE_LOCALE_DIR=\&quot;&quot;/usr/local/share/locale&quot;\&quot; -pthread -I/usr/include/gtk-2.0 -I/usr/lib/gtk-2.0/include -I/usr/include/pango-1.0 -I/usr/include/atk-1.0 -I/usr/include/cairo -I/usr/include/pixman-1 -I/usr/include/libpng16 -I/usr/include/gdk-pixbuf-2.0 -I/usr/include/libpng16 -I/usr/include/pango-1.0 -I/usr/include/harfbuzz -I/usr/include/pango-1.0 -I/usr/include/glib-2.0 -I/usr/lib/glib-2.0/include -I/usr/include/freetype2    -frepo -fno-implement-inlines -ansi -pedantic -pipe -Wall -Winline -Wshadow -Wsign-compare -Woverloaded-virtual -Wextra --param max-inline-insns-single=400 -g -O2 -MT utils.o -MD -MP -MF .deps/utils.Tpo -c -o utils.o utils.cpp
mv -f .deps/utils.Tpo .deps/utils.Po
g++ -DHAVE_CONFIG_H -I. -I.. -DPACKAGE_DATA_DIR=\&quot;&quot;/usr/local/share&quot;\&quot; -DPACKAGE_LOCALE_DIR=\&quot;&quot;/usr/local/share/locale&quot;\&quot; -pthread -I/usr/include/gtk-2.0 -I/usr/lib/gtk-2.0/include -I/usr/include/pango-1.0 -I/usr/include/atk-1.0 -I/usr/include/cairo -I/usr/include/pixman-1 -I/usr/include/libpng16 -I/usr/include/gdk-pixbuf-2.0 -I/usr/include/libpng16 -I/usr/include/pango-1.0 -I/usr/include/harfbuzz -I/usr/include/pango-1.0 -I/usr/include/glib-2.0 -I/usr/lib/glib-2.0/include -I/usr/include/freetype2    -frepo -fno-implement-inlines -ansi -pedantic -pipe -Wall -Winline -Wshadow -Wsign-compare -Woverloaded-virtual -Wextra --param max-inline-insns-single=400 -g -O2 -MT loader.o -MD -MP -MF .deps/loader.Tpo -c -o loader.o loader.cpp
mv -f .deps/loader.Tpo .deps/loader.Po
g++ -DHAVE_CONFIG_H -I. -I.. -DPACKAGE_DATA_DIR=\&quot;&quot;/usr/local/share&quot;\&quot; -DPACKAGE_LOCALE_DIR=\&quot;&quot;/usr/local/share/locale&quot;\&quot; -pthread -I/usr/include/gtk-2.0 -I/usr/lib/gtk-2.0/include -I/usr/include/pango-1.0 -I/usr/include/atk-1.0 -I/usr/include/cairo -I/usr/include/pixman-1 -I/usr/include/libpng16 -I/usr/include/gdk-pixbuf-2.0 -I/usr/include/libpng16 -I/usr/include/pango-1.0 -I/usr/include/harfbuzz -I/usr/include/pango-1.0 -I/usr/include/glib-2.0 -I/usr/lib/glib-2.0/include -I/usr/include/freetype2    -frepo -fno-implement-inlines -ansi -pedantic -pipe -Wall -Winline -Wshadow -Wsign-compare -Woverloaded-virtual -Wextra --param max-inline-insns-single=400 -g -O2 -MT strip_leading.o -MD -MP -MF .deps/strip_leading.Tpo -c -o strip_leading.o strip_leading.cpp
mv -f .deps/strip_leading.Tpo .deps/strip_leading.Po
g++ -DHAVE_CONFIG_H -I. -I.. -DPACKAGE_DATA_DIR=\&quot;&quot;/usr/local/share&quot;\&quot; -DPACKAGE_LOCALE_DIR=\&quot;&quot;/usr/local/share/locale&quot;\&quot; -pthread -I/usr/include/gtk-2.0 -I/usr/lib/gtk-2.0/include -I/usr/include/pango-1.0 -I/usr/include/atk-1.0 -I/usr/include/cairo -I/usr/include/pixman-1 -I/usr/include/libpng16 -I/usr/include/gdk-pixbuf-2.0 -I/usr/include/libpng16 -I/usr/include/pango-1.0 -I/usr/include/harfbuzz -I/usr/include/pango-1.0 -I/usr/include/glib-2.0 -I/usr/lib/glib-2.0/include -I/usr/include/freetype2    -frepo -fno-implement-inlines -ansi -pedantic -pipe -Wall -Winline -Wshadow -Wsign-compare -Woverloaded-virtual -Wextra --param max-inline-insns-single=400 -g -O2 -MT strip_trailing.o -MD -MP -MF .deps/strip_trailing.Tpo -c -o strip_trailing.o strip_trailing.cpp
mv -f .deps/strip_trailing.Tpo .deps/strip_trailing.Po
g++ -DHAVE_CONFIG_H -I. -I.. -DPACKAGE_DATA_DIR=\&quot;&quot;/usr/local/share&quot;\&quot; -DPACKAGE_LOCALE_DIR=\&quot;&quot;/usr/local/share/locale&quot;\&quot; -pthread -I/usr/include/gtk-2.0 -I/usr/lib/gtk-2.0/include -I/usr/include/pango-1.0 -I/usr/include/atk-1.0 -I/usr/include/cairo -I/usr/include/pixman-1 -I/usr/include/libpng16 -I/usr/include/gdk-pixbuf-2.0 -I/usr/include/libpng16 -I/usr/include/pango-1.0 -I/usr/include/harfbuzz -I/usr/include/pango-1.0 -I/usr/include/glib-2.0 -I/usr/lib/glib-2.0/include -I/usr/include/freetype2    -frepo -fno-implement-inlines -ansi -pedantic -pipe -Wall -Winline -Wshadow -Wsign-compare -Woverloaded-virtual -Wextra --param max-inline-insns-single=400 -g -O2 -MT date.o -MD -MP -MF .deps/date.Tpo -c -o date.o date.cpp
mv -f .deps/date.Tpo .deps/date.Po
g++ -DHAVE_CONFIG_H -I. -I.. -DPACKAGE_DATA_DIR=\&quot;&quot;/usr/local/share&quot;\&quot; -DPACKAGE_LOCALE_DIR=\&quot;&quot;/usr/local/share/locale&quot;\&quot; -pthread -I/usr/include/gtk-2.0 -I/usr/lib/gtk-2.0/include -I/usr/include/pango-1.0 -I/usr/include/atk-1.0 -I/usr/include/cairo -I/usr/include/pixman-1 -I/usr/include/libpng16 -I/usr/include/gdk-pixbuf-2.0 -I/usr/include/libpng16 -I/usr/include/pango-1.0 -I/usr/include/harfbuzz -I/usr/include/pango-1.0 -I/usr/include/glib-2.0 -I/usr/lib/glib-2.0/include -I/usr/include/freetype2    -frepo -fno-implement-inlines -ansi -pedantic -pipe -Wall -Winline -Wshadow -Wsign-compare -Woverloaded-virtual -Wextra --param max-inline-insns-single=400 -g -O2 -MT document.o -MD -MP -MF .deps/document.Tpo -c -o document.o document.cpp
g++: internal compiler error: Killed (program cc1plus)
Please submit a full bug report,
with preprocessed source if appropriate.
See &lt;http://gcc.gnu.org/bugs.html&gt; for instructions.
make[2]: *** [document.o] Error 4
make[2]: Leaving directory `/opt/build_testtools/sudoku/sudoku-savant-1.3/src&apos;
make[1]: *** [all-recursive] Error 1
make[1]: Leaving directory `/opt/build_testtools/sudoku/sudoku-savant-1.3&apos;
make: *** [all] Error 2</thetext>
  </long_desc><long_desc isprivate="0" >
    <commentid>36098</commentid>
    <comment_count>1</comment_count>
    <who name="Stoicescu Cornel">corneliux.stoicescu</who>
    <bug_when>2013-08-30 14:11:59 +0000</bug_when>
    <thetext>Not happening in master:5745e45b18e5099e94b4d5a73bc97dc6d4cdc91f (1.5 M4 RC2) on core-image-sato-sdk-sugarbay (a x86-64 image)

Note: meta-intel:164067980e18e8ba60b317677ced2d75c3725dbe</thetext>
  </long_desc><long_desc isprivate="0" >
    <commentid>36163</commentid>
    <comment_count>2</comment_count>
    <who name="Laurentiu Palcu">laurentiu.palcu</who>
    <bug_when>2013-09-02 15:14:58 +0000</bug_when>
    <thetext>With the latest commit on master (1b814498b60d5f354d8cc5bdf568b91baf0745dc), sudoku-savant compiles just fine on core-image-sato-sdk for qemux86-64. Closing the bug.</thetext>
  </long_desc><long_desc isprivate="0" >
    <commentid>38180</commentid>
    <comment_count>3</comment_count>
    <who name="Stoicescu Cornel">corneliux.stoicescu</who>
    <bug_when>2013-10-25 14:36:16 +0000</bug_when>
    <thetext>Marking as VERIFIED ss per 1.5 M5 RC8 test results: https://wiki.yoctoproject.org/wiki/WW41_-_2013-10-08_-_Full_Pass_Release_1.5_M5.rc8</thetext>
  </long_desc>
      
      

    </bug>

</bugzilla>