<?xml version="1.0" encoding="UTF-8" standalone="yes" ?>
<!DOCTYPE bugzilla SYSTEM "https://bugzilla.yoctoproject.org/page.cgi?id=bugzilla.dtd">

<bugzilla version="5.0.6"
          urlbase="https://bugzilla.yoctoproject.org/"
          
          maintainer="it-coreprojects-helpdesk@linuxfoundation.org"
>

    <bug>
          <bug_id>5509</bug_id>
          
          <creation_ts>2013-11-07 20:08:08 +0000</creation_ts>
          <short_desc>mips imagetest is failing for KernelModuleTest</short_desc>
          <delta_ts>2013-11-21 15:37:32 +0000</delta_ts>
          <reporter_accessible>1</reporter_accessible>
          <cclist_accessible>1</cclist_accessible>
          <classification_id>7</classification_id>
          <classification>Build System, Metadata &amp; Runtime</classification>
          <product>OE-Core</product>
          <component>kernel</component>
          <version>unspecified</version>
          <rep_platform>Other</rep_platform>
          <op_sys>Multiple</op_sys>
          <bug_status>RESOLVED</bug_status>
          <resolution>FIXED</resolution>
          
          
          <bug_file_loc></bug_file_loc>
          <status_whiteboard>autobuilder</status_whiteboard>
          <keywords></keywords>
          <priority>Undecided</priority>
          <bug_severity>normal</bug_severity>
          <target_milestone>---</target_milestone>
          
          
          <everconfirmed>1</everconfirmed>
          <reporter name="Nitin Kamble">nitin.a.kamble</reporter>
          <assigned_to name="Nitin Kamble">nitin.a.kamble</assigned_to>
          <cc>bruce.ashfield</cc>
    
    <cc>richard.purdie</cc>
    
    <cc>tom.zanussi</cc>
          
          
          <cf_os>---</cf_os>
          <cf_regression_type>---</cf_regression_type>
          
          <cf_docchange>No (bug/feature does not impact docs)</cf_docchange>

      

      

      

          <comment_sort_order>oldest_to_newest</comment_sort_order>  
          <long_desc isprivate="0" >
    <commentid>38673</commentid>
    <comment_count>0</comment_count>
    <who name="Nitin Kamble">nitin.a.kamble</who>
    <bug_when>2013-11-07 20:08:08 +0000</bug_when>
    <thetext>Link to the autobuilder log: 
  http://autobuilder.yoctoproject.org:8011/builders/nightly-mips/builds/354/steps/Running%20Sanity%20Tests/logs/stdio



Build Configuration:
BB_VERSION        = &quot;1.21.0&quot;
BUILD_SYS         = &quot;x86_64-linux&quot;
NATIVELSBSTRING   = &quot;Fedora-19&quot;
TARGET_SYS        = &quot;mips-poky-linux&quot;
MACHINE           = &quot;qemumips&quot;
DISTRO            = &quot;poky&quot;
DISTRO_VERSION    = &quot;1.5+snapshot-20131106&quot;
TUNE_FEATURES     = &quot;o32 bigendian fpu-hard mips32&quot;
TARGET_FPU        = &quot;&quot;
meta              
meta-yocto        
meta-yocto-bsp    = &quot;master:d6cc7c8ed76c8b1117cf03c7bd4b0742f98f79b3&quot;
meta-qt3          = &quot;master:b73552fb998fd30a01dbee5a172e432a16078222

...

| test_kernel_module (oeqa.runtime.kernelmodule.KernelModuleTest) ... FAIL
| test_dmesg (oeqa.runtime.dmesg.DmesgTest) ... ok
| 
| ======================================================================
| FAIL: test_kernel_module (oeqa.runtime.kernelmodule.KernelModuleTest)
| ----------------------------------------------------------------------
| Traceback (most recent call last):
|   File &quot;/home/pokybuild/yocto-autobuilder/yocto-slave/nightly-mips/build/meta/lib/oeqa/utils/decorators.py&quot;, line 48, in wrapped_f
|     return f(*args)
|   File &quot;/home/pokybuild/yocto-autobuilder/yocto-slave/nightly-mips/build/meta/lib/oeqa/utils/decorators.py&quot;, line 48, in wrapped_f
|     return f(*args)
|   File &quot;/home/pokybuild/yocto-autobuilder/yocto-slave/nightly-mips/build/meta/lib/oeqa/runtime/kernelmodule.py&quot;, line 30, in test_kernel_module
|     self.assertEqual(status, 0, msg=&quot;\n&quot;.join([cmd, output]))
| AssertionError: 255 != 0 : cd /usr/src/kernel &amp;&amp; make scripts
|   HOSTCC  scripts/basic/fixdep
|   HOSTCC  scripts/kconfig/conf.o
|   SHIPPED scripts/kconfig/zconf.tab.c
|   SHIPPED scripts/kconfig/zconf.lex.c
|   SHIPPED scripts/kconfig/zconf.hash.c
|   HOSTCC  scripts/kconfig/zconf.tab.o
|   HOSTLD  scripts/kconfig/conf
| scripts/kconfig/conf --silentoldconfig Kconfig
|   CC      scripts/mod/empty.o
|   HOSTCC  scripts/mod/mk_elfconfig
|   MKELF   scripts/mod/elfconfig.h
|   CC      scripts/mod/devicetable-offsets.s
|   GEN     scripts/mod/devicetable-offsets.h
|   HOSTCC  scripts/mod/file2alias.o
|   HOSTCC  scripts/mod/modpost.o
|   HOSTCC  scripts/mod/sumversion.o
|   HOSTLD  scripts/mod/modpost
|   HOSTCC  scripts/kallsyms
| 
| [!!! SSH command timed out after 900 seconds and it was killed]
| 
| ----------------------------------------------------------------------
| Ran 46 tests in 3441.941s
| 
| FAILED (failures=1)
| NOTE: Sending SIGTERM to runqemu
| DEBUG: Python function do_testimage finished
| ERROR: Function failed: core-image-sato-sdk - FAILED - check the task log and the ssh log
NOTE: recipe core-image-sato-sdk-1.0-r0: task do_testimage: Failed
ERROR: Task 2 (/home/pokybuild/yocto-autobuilder/yocto-slave/nightly-mips/build/meta/recipes-sato/images/core-image-sato-sdk.bb, do_testimage) failed with exit code &apos;1&apos;</thetext>
  </long_desc><long_desc isprivate="0" >
    <commentid>38786</commentid>
    <comment_count>1</comment_count>
    <who name="Richard Purdie">richard.purdie</who>
    <bug_when>2013-11-14 15:53:35 +0000</bug_when>
    <thetext>Can we check if http://git.yoctoproject.org/cgit.cgi/poky/commit/?id=1e16634af63a49c3a59335e47d96691ff4df2a7a was in this build. If it was not this timeout issue is probably resolved after this commit.</thetext>
  </long_desc><long_desc isprivate="0" >
    <commentid>38787</commentid>
    <comment_count>2</comment_count>
    <who name="Darren Hart">dvhart</who>
    <bug_when>2013-11-14 15:55:01 +0000</bug_when>
    <thetext>Nitin, can you look up RP&apos;s question.</thetext>
  </long_desc><long_desc isprivate="0" >
    <commentid>38794</commentid>
    <comment_count>3</comment_count>
    <who name="Nitin Kamble">nitin.a.kamble</who>
    <bug_when>2013-11-14 18:59:55 +0000</bug_when>
    <thetext>RP,
  FYI, the commit 1e16634af63a49c3a59335e47d96691ff4df2a7a was not in the poky at the time of this build failure.</thetext>
  </long_desc><long_desc isprivate="0" >
    <commentid>38989</commentid>
    <comment_count>4</comment_count>
    <who name="Richard Purdie">richard.purdie</who>
    <bug_when>2013-11-21 15:37:32 +0000</bug_when>
    <thetext>We&apos;re not seeing this in master and I think the commit referenced should stop this error appearing so closing as fixed by the commit referenced above.</thetext>
  </long_desc>
      
      

    </bug>

</bugzilla>