<?xml version="1.0" encoding="UTF-8" standalone="yes" ?>
<!DOCTYPE bugzilla SYSTEM "https://bugzilla.yoctoproject.org/page.cgi?id=bugzilla.dtd">

<bugzilla version="5.0.6"
          urlbase="https://bugzilla.yoctoproject.org/"
          
          maintainer="it-coreprojects-helpdesk@linuxfoundation.org"
>

    <bug>
          <bug_id>587</bug_id>
          
          <creation_ts>2010-12-13 00:45:29 +0000</creation_ts>
          <short_desc>gnome-desktop: do_compile failed</short_desc>
          <delta_ts>2010-12-28 23:24:48 +0000</delta_ts>
          <reporter_accessible>1</reporter_accessible>
          <cclist_accessible>1</cclist_accessible>
          <classification_id>7</classification_id>
          <classification>Build System, Metadata &amp; Runtime</classification>
          <product>Meta-yocto</product>
          <component>meta-yocto</component>
          <version>1.0</version>
          <rep_platform>x86</rep_platform>
          <op_sys>Multiple</op_sys>
          <bug_status>VERIFIED</bug_status>
          <resolution>FIXED</resolution>
          
          
          <bug_file_loc></bug_file_loc>
          <status_whiteboard></status_whiteboard>
          <keywords></keywords>
          <priority>High</priority>
          <bug_severity>critical</bug_severity>
          <target_milestone>1.0 M2</target_milestone>
          
          
          <everconfirmed>1</everconfirmed>
          <reporter name="Dexuan Cui">dexuan.cui</reporter>
          <assigned_to name="Dexuan Cui">dexuan.cui</assigned_to>
          <cc>edwin.zhai</cc>
    
    <cc>ke.yu</cc>
    
    <cc>kevin.tian</cc>
    
    <cc>poky.bs.watcher</cc>
    
    <cc>poky.watcher</cc>
    
    <cc>richard.purdie</cc>
    
    <cc>sgw</cc>
          
          
          <cf_os>---</cf_os>
          <cf_regression_type>---</cf_regression_type>
          <cf_verified>Program Management</cf_verified>
          <cf_docchange>---</cf_docchange>

      

      

      

          <comment_sort_order>oldest_to_newest</comment_sort_order>  
          <long_desc isprivate="0" >
    <commentid>11094</commentid>
    <comment_count>0</comment_count>
    <who name="Dexuan Cui">dexuan.cui</who>
    <bug_when>2010-12-13 00:45:29 +0000</bug_when>
    <thetext>nightly logs show it failed on ppc, arm, x86-64, etc:


ERROR: Task failed: (&apos;function do_compile failed&apos;, &apos;/srv/home/pokybuild/poky-slave/nightly-release/build/build/tmp/work/ppc603e-poky-linux/gnome-desktop-2.32.1-r0/temp/log.do_compile.29479&apos;)
ERROR: Logfile of failure stored in: /srv/home/pokybuild/poky-slave/nightly-release/build/build/tmp/work/ppc603e-poky-linux/gnome-desktop-2.32.1-r0/temp/log.do_compile.29479
Log data follows:
| NOTE: make -j 16 GCONF_DISABLE_MAKEFILE_SCHEMA_INSTALL=1
| ...
| xsltproc -o lgpl-vi.omf --stringparam db2omf.basename lgpl --stringparam db2omf.format &apos;docbook&apos; --stringparam db2omf.dtd &quot;-//OASIS//DTD DocBook XML V4.1.2//EN&quot; --stringparam db2omf.lang vi --stringparam db2omf.omf_dir &quot;/usr/share/omf&quot; --stringparam db2omf.help_dir &quot;/usr/share/gnome/help&quot; --stringparam db2omf.omf_in &quot;/srv/home/pokybuild/poky-slave/nightly-release/build/build/tmp/work/ppc603e-poky-linux/gnome-desktop-2.32.1-r0/gnome-desktop-2.32.1/desktop-docs/lgpl/lgpl.omf.in&quot;  `/srv/home/pokybuild/poky-slave/nightly-release/build/build/tmp/sysroots/x86_64-linux/usr/bin/pkg-config --variable db2omf gnome-doc-utils` vi/lgpl.xml || { rm -f &quot;lgpl-vi.omf&quot;; exit 1; }
| http://www.oasis-open.org/docbook/xml/4.1.2/dbpoolx.mod:632: parser warning : PEReference: %notation.class; not found
| 	%local.graphics.attrib;&quot;
| 	                        ^
| ...
| 	      		       ^
| Entity: line 1: parser error : Content error in the external subset
|  %graphics.attrib;
|                   ^
| Entity: line 4:
| 	format		() #IMPLIED
| 	      		          ^
| unable to parse oc/lgpl.xml
| make[3]: *** [lgpl-oc.omf] Error 1
| error : Operation in progress
| http://www.oasis-open.org/docbook/xml/4.1.2/docbookx.dtd:110: warning: failed to load external entity &quot;http://www.oasis-open.org/docbook/xml/4.1.2/dbhierx.mod&quot;
| %dbhier;
|         ^
| Entity: line 1:
|  %dbhier;
|          ^
| make[3]: Leaving directory `/srv/home/pokybuild/poky-slave/nightly-release/build/build/tmp/work/ppc603e-poky-linux/gnome-desktop-2.32.1-r0/gnome-desktop-2.32.1/desktop-docs/lgpl&apos;
| make[2]: *** [all-recursive] Error 1
| make[2]: Leaving directory `/srv/home/pokybuild/poky-slave/nightly-release/build/build/tmp/work/ppc603e-poky-linux/gnome-desktop-2.32.1-r0/gnome-desktop-2.32.1/desktop-docs&apos;
| make[1]: *** [all-recursive] Error 1
| make[1]: Leaving directory `/srv/home/pokybuild/poky-slave/nightly-release/build/build/tmp/work/ppc603e-poky-linux/gnome-desktop-2.32.1-r0/gnome-desktop-2.32.1&apos;
| make: *** [all] Error 2
| FATAL: oe_runmake failed
| ERROR: Task failed: (&apos;function do_compile failed&apos;, &apos;/srv/home/pokybuild/poky-slave/nightly-release/build/build/tmp/work/ppc603e-poky-linux/gnome-desktop-2.32.1-r0/temp/log.do_compile.29479&apos;</thetext>
  </long_desc><long_desc isprivate="0" >
    <commentid>11113</commentid>
    <comment_count>1</comment_count>
    <who name="Edwin Zhai">edwin.zhai</who>
    <bug_when>2010-12-13 03:48:02 +0000</bug_when>
    <thetext>I have tried on latest poky master (3a78838d4f1db75d06b5d3df042638f34cf328f5), there is no build failure. I can successfully build poky-image-sato, then &quot;bitbake gnome-desktop&quot;. 

Is this log came from world build?</thetext>
  </long_desc><long_desc isprivate="0" >
    <commentid>11150</commentid>
    <comment_count>2</comment_count>
    <who name="Dexuan Cui">dexuan.cui</who>
    <bug_when>2010-12-13 19:11:12 +0000</bug_when>
    <thetext>(In reply to comment #1)
&gt; I have tried on latest poky master (3a78838d4f1db75d06b5d3df042638f34cf328f5),
&gt; there is no build failure. I can successfully build poky-image-sato, then
&gt; &quot;bitbake gnome-desktop&quot;. 
&gt; Is this log came from world build?

The log is http://autobuilder.pokylinux.org:8010/builders/nightly-release/builds/146/steps/shell_70/logs/stdio

Looks this issue is autobuilder-specific??? I also can&apos;t reproduce the issue locally.
I noticed the bug yesterday when I checked nightly logs: there were a bundle of build failurs and gnome-desktop was a cause.</thetext>
  </long_desc><long_desc isprivate="0" >
    <commentid>11152</commentid>
    <comment_count>3</comment_count>
    <who name="Dexuan Cui">dexuan.cui</who>
    <bug_when>2010-12-13 23:55:52 +0000</bug_when>
    <thetext>A patch was made:
http://git.pokylinux.org/cgit.cgi/poky-contrib/commit/?h=dcui/master&amp;id=02e91b163925553bd14ddbc69d44620da0297f5c</thetext>
  </long_desc><long_desc isprivate="0" >
    <commentid>11167</commentid>
    <comment_count>4</comment_count>
    <who name="Dexuan Cui">dexuan.cui</who>
    <bug_when>2010-12-14 19:13:19 +0000</bug_when>
    <thetext>The fix is in master now:
http://git.pokylinux.org/cgit/cgit.cgi/poky/commit/?id=e8017dc3cbfc40a03d47ed170518726075937bd3

Since the bug now only happens on autobuilder and I need to wait several hours for the nightly meta-toolchian-sdk build logs, I can only mark the bug as RESOLVED in several hours today.</thetext>
  </long_desc><long_desc isprivate="0" >
    <commentid>11205</commentid>
    <comment_count>5</comment_count>
    <who name="Dexuan Cui">dexuan.cui</who>
    <bug_when>2010-12-15 20:06:28 +0000</bug_when>
    <thetext>(In reply to comment #4)
&gt; The fix is in master now:
&gt; http://git.pokylinux.org/cgit/cgit.cgi/poky/commit/?id=e8017dc3cbfc40a03d47ed170518726075937bd3
&gt; Since the bug now only happens on autobuilder and I need to wait several hours
&gt; for the nightly meta-toolchian-sdk build logs, I can only mark the bug as
&gt; RESOLVED in several hours today.

autobuilder&apos;s poky-incremental logs show the bug is fixed:
http://autobuilder.pokylinux.org:8010/builders/poky-incremental/builds/30/steps/shell_37/logs/stdio

http://autobuilder.pokylinux.org:8010/builders/poky-incremental/builds/30/steps/shell_38/logs/stdio

http://autobuilder.pokylinux.org:8010/builders/poky-incremental/builds/30/steps/shell_39/logs/stdio

http://autobuilder.pokylinux.org:8010/builders/poky-incremental/builds/30/steps/shell_40/logs/stdio</thetext>
  </long_desc><long_desc isprivate="0" >
    <commentid>11206</commentid>
    <comment_count>6</comment_count>
    <who name="Dexuan Cui">dexuan.cui</who>
    <bug_when>2010-12-15 20:07:10 +0000</bug_when>
    <thetext>(In reply to comment #5)
&gt; (In reply to comment #4)
&gt; &gt; The fix is in master now:
&gt; &gt; http://git.pokylinux.org/cgit/cgit.cgi/poky/commit/?id=e8017dc3cbfc40a03d47ed170518726075937bd3
&gt; &gt; Since the bug now only happens on autobuilder and I need to wait several hours
&gt; &gt; for the nightly meta-toolchian-sdk build logs, I can only mark the bug as
&gt; &gt; RESOLVED in several hours today.
&gt; autobuilder&apos;s poky-incremental logs show the bug is fixed:
&gt; http://autobuilder.pokylinux.org:8010/builders/poky-incremental/builds/30/steps/shell_37/logs/stdio
&gt; http://autobuilder.pokylinux.org:8010/builders/poky-incremental/builds/30/steps/shell_38/logs/stdio
&gt; http://autobuilder.pokylinux.org:8010/builders/poky-incremental/builds/30/steps/shell_39/logs/stdio
&gt; http://autobuilder.pokylinux.org:8010/builders/poky-incremental/builds/30/steps/shell_40/logs/stdio

VERIFY it.</thetext>
  </long_desc>
      
      

    </bug>

</bugzilla>