<?xml version="1.0" encoding="UTF-8" standalone="yes" ?>
<!DOCTYPE bugzilla SYSTEM "https://bugzilla.yoctoproject.org/page.cgi?id=bugzilla.dtd">

<bugzilla version="5.0.6"
          urlbase="https://bugzilla.yoctoproject.org/"
          
          maintainer="it-coreprojects-helpdesk@linuxfoundation.org"
>

    <bug>
          <bug_id>6246</bug_id>
          
          <creation_ts>2014-04-28 16:18:03 +0000</creation_ts>
          <short_desc>dbus-test_1.6.18.bb, do_compile) failed</short_desc>
          <delta_ts>2014-08-29 08:15:12 +0000</delta_ts>
          <reporter_accessible>1</reporter_accessible>
          <cclist_accessible>1</cclist_accessible>
          <classification_id>7</classification_id>
          <classification>Build System, Metadata &amp; Runtime</classification>
          <product>OE-Core</product>
          <component>core</component>
          <version>1.7</version>
          <rep_platform>All</rep_platform>
          <op_sys>ppc</op_sys>
          <bug_status>VERIFIED</bug_status>
          <resolution>FIXED</resolution>
          
          
          <bug_file_loc></bug_file_loc>
          <status_whiteboard></status_whiteboard>
          <keywords></keywords>
          <priority>Medium+</priority>
          <bug_severity>normal</bug_severity>
          <target_milestone>1.7</target_milestone>
          
          
          <everconfirmed>1</everconfirmed>
          <reporter name="Nitin Kamble">nitin.a.kamble</reporter>
          <assigned_to name="Chunrong Guo">b40290</assigned_to>
          <cc>alexandru.c.georgescu</cc>
    
    <cc>bluelightning</cc>
    
    <cc>bogdanx.a.voiculescu</cc>
    
    <cc>meta.mr.watcher</cc>
    
    <cc>meta.watcher</cc>
    
    <cc>sgw</cc>
    
    <cc>zhenhua.luo</cc>
          
          <qa_contact name="Andra Necula">andrax.g.necula</qa_contact>
          <cf_os>---</cf_os>
          <cf_regression_type>---</cf_regression_type>
          
          <cf_docchange>No (bug/feature does not impact docs)</cf_docchange>

      

      

      

          <comment_sort_order>oldest_to_newest</comment_sort_order>  
          <long_desc isprivate="0" >
    <commentid>43047</commentid>
    <comment_count>0</comment_count>
    <who name="Nitin Kamble">nitin.a.kamble</who>
    <bug_when>2014-04-28 16:18:03 +0000</bug_when>
    <thetext>Detailed log of last build step: http://autobuilder.yoctoproject.org/main/builders/nightly-fsl-ppc-lsb/builds/58/steps/BuildImages/logs/stdio

This is happening on multiple architectures.

| powerpc-poky-linux-gnuspe-libtool: link: powerpc-poky-linux-gnuspe-gcc -m32 -mcpu=8548 -mabi=spe -mspe -mfloat-gprs=double --sysroot=/home/pokybuild/yocto-autobuilder/yocto-slave/nightly-fsl-ppc-lsb/build/build/tmp/sysroots/p1022ds -Wall -Wextra -Wchar-subscripts -Wmissing-declarations -Wmissing-prototypes -Wnested-externs -Wpointer-arith -Wcast-align -Wno-address -Wfloat-equal -Wdeclaration-after-statement -Wno-missing-field-initializers -Wno-unused-paramet er -Wno- sign-compare -Wno-pointer-sign -Wno-type-limits -fno-common -fno-strict-aliasing -O2 -pipe -g -feliminate-unused-debug-types -fstack-protector-all -D_FORTIFY_SOURCE=2 -Wl,-O1 -Wl,--hash-style=gnu -Wl,--as-needed -Wl,-z -Wl,relro -Wl,-z -Wl,now -o dbus-test dbus-test-main.o -Wl,--export-dynamic ./.libs/libdbus-internal.a -lpthread -lrt
| ./.libs/libdbus-internal.a(libdbus_internal_la-dbus-hash.o):(.debug_loc+0x188c): undefined reference to `.LCL26&apos;
| ./.libs/libdbus-internal.a(libdbus_internal_la-dbus-hash.o):(.debug_loc+0x18ab): undefined reference to `.LCL26&apos;
| collect2: error: ld returned 1 exit status
| Makefile:995: recipe for target &apos;dbus-test&apos; failed
| make[3]: *** [dbus-test] Error 1
| make[3]: Leaving directory &apos;/home/pokybuild/yocto-autobuilder/yocto-slave/nightly-fsl-ppc-lsb/build/build/tmp/work/ppce500v2-poky-linux-gnuspe/dbus-test/1.6.18-r0/build/dbus&apos;
| Makefile:894: recipe for target &apos;all&apos; failed
| make[2]: *** [all] Error 2
| make[2 ]: Leavi ng directory &apos;/home/pokybuild/yocto-autobuilder/yocto-slave/nightly-fsl-ppc-lsb/build/build/tmp/work/ppce500v2-poky-linux-gnuspe/dbus-test/1.6.18-r0/build/dbus&apos;
| Makefile:647: recipe for target &apos;all-recursive&apos; failed
| make[1]: *** [all-recursive] Error 1
| make[1]: Leaving directory &apos;/home/pokybuild/yocto-autobuilder/yocto-slave/nightly-fsl-ppc-lsb/build/build/tmp/work/ppce500v2-poky-linux-gnuspe/dbus-test/1.6.18-r0/build&apos;
| Makefile:516: recipe for target &apos;all&apos; failed
| make: *** [all] Error 2
| ERROR: oe_runmake failed
| WARNING: /home/pokybuild/yocto-autobuilder/yocto-slave/nightly-fsl-ppc-lsb/build/build/tmp/work/ppce500v2-poky-linux-gnuspe/dbus-test/1.6.18-r0/temp/run.do_compile.25152:1 exit 1 from
| exit 1
| ERROR: Function failed: do_compile (log file is located at /home/pokybuild/yocto-autobuilder/yocto-slave/nightly-fsl-ppc-lsb/build/build/tmp/work/ppce500v2-poky-linux-gnuspe/dbus-test/1.6.18-r0/temp/log.do_compile.25152)
ERROR: Tas k 5275 ( /home/pokybuild/yocto-autobuilder/yocto-slave/nightly-fsl-ppc-lsb/build/meta/recipes-core/dbus/dbus-test_1.6.18.bb, do_compile) failed with exit code &apos;1&apos;
Summary: There was 1 ERROR message shown, returning a non-zero exit code.</thetext>
  </long_desc><long_desc isprivate="0" >
    <commentid>43214</commentid>
    <comment_count>1</comment_count>
    <who name="Zhenhua Luo">zhenhua.luo</who>
    <bug_when>2014-05-09 08:47:43 +0000</bug_when>
    <thetext>I tried several times to build dbus-test, all passed. I can&apos;t reproduce the build issue.

Is this issue still exists? I see latest report of nightly-fsl-ppc-lsb passed.
https://autobuilder.yoctoproject.org/main/builders/nightly-fsl-ppc-lsb/builds/82/steps/BuildImages/logs/stdio</thetext>
  </long_desc><long_desc isprivate="0" >
    <commentid>43215</commentid>
    <comment_count>2</comment_count>
    <who name="Zhenhua Luo">zhenhua.luo</who>
    <bug_when>2014-05-09 08:59:40 +0000</bug_when>
    <thetext>If the issue persists, please provide the detailed reproduce steps.</thetext>
  </long_desc><long_desc isprivate="0" >
    <commentid>43238</commentid>
    <comment_count>3</comment_count>
    <who name="Zhenhua Luo">zhenhua.luo</who>
    <bug_when>2014-05-11 03:41:37 +0000</bug_when>
    <thetext>The issue can&apos;t be reproduced.</thetext>
  </long_desc><long_desc isprivate="0" >
    <commentid>43239</commentid>
    <comment_count>4</comment_count>
    <who name="Zhenhua Luo">zhenhua.luo</who>
    <bug_when>2014-05-11 03:42:43 +0000</bug_when>
    <thetext>The issue can&apos;t be reproduced, please reopen if the issue appears and provide the reproduce steps.</thetext>
  </long_desc><long_desc isprivate="0" >
    <commentid>45321</commentid>
    <comment_count>5</comment_count>
    <who name="Andra Necula">andrax.g.necula</who>
    <bug_when>2014-08-29 08:15:12 +0000</bug_when>
    <thetext>Verified on
poky 2d1660112e54653f7bb763939d0416472c49fe01
Ubuntu 14.04, x86_64
Cheers! Andra</thetext>
  </long_desc>
      
      

    </bug>

</bugzilla>