<?xml version="1.0" encoding="UTF-8" standalone="yes" ?>
<!DOCTYPE bugzilla SYSTEM "https://bugzilla.yoctoproject.org/page.cgi?id=bugzilla.dtd">

<bugzilla version="5.0.6"
          urlbase="https://bugzilla.yoctoproject.org/"
          
          maintainer="it-coreprojects-helpdesk@linuxfoundation.org"
>

    <bug>
          <bug_id>6459</bug_id>
          
          <creation_ts>2014-06-18 00:36:22 +0000</creation_ts>
          <short_desc>lttng-modules recipe fails with kernel 3.14.5</short_desc>
          <delta_ts>2014-06-19 14:50:25 +0000</delta_ts>
          <reporter_accessible>1</reporter_accessible>
          <cclist_accessible>1</cclist_accessible>
          <classification_id>7</classification_id>
          <classification>Build System, Metadata &amp; Runtime</classification>
          <product>OE-Core</product>
          <component>kernel</component>
          <version>1.7</version>
          <rep_platform>x86</rep_platform>
          <op_sys>Multiple</op_sys>
          <bug_status>RESOLVED</bug_status>
          <resolution>FIXED</resolution>
          
          
          <bug_file_loc></bug_file_loc>
          <status_whiteboard></status_whiteboard>
          <keywords></keywords>
          <priority>Undecided</priority>
          <bug_severity>normal</bug_severity>
          <target_milestone>---</target_milestone>
          
          
          <everconfirmed>1</everconfirmed>
          <reporter name="Nitin Kamble">nitin.a.kamble</reporter>
          <assigned_to name="Bruce Ashfield">bruce.ashfield</assigned_to>
          <cc>bruce.ashfield</cc>
    
    <cc>richard.purdie</cc>
    
    <cc>tom.zanussi</cc>
          
          
          <cf_os>---</cf_os>
          <cf_regression_type>---</cf_regression_type>
          
          <cf_docchange>No (bug/feature does not impact docs)</cf_docchange>

      

      

      

          <comment_sort_order>oldest_to_newest</comment_sort_order>  
          <long_desc isprivate="0" >
    <commentid>44044</commentid>
    <comment_count>0</comment_count>
    <who name="Nitin Kamble">nitin.a.kamble</who>
    <bug_when>2014-06-18 00:36:22 +0000</bug_when>
    <thetext>https://autobuilder.yoctoproject.org/main/builders/nightly-x86-64-lsb/builds/142/steps/BuildImages/logs/stdio


|   CC [M]  /home/pokybuild/yocto-autobuilder/yocto-slave/nightly-x86-64-lsb/build/build/tmp/work/qemux86_64-poky-linux/lttng-modules/2.4.1-r0/git/probes/lttng-probe-block.o
| In file included from /home/pokybuild/yocto-autobuilder/yocto-slave/nightly-x86-64-lsb/build/build/tmp/work/qemux86_64-poky-linux/lttng-modules/2.4.1-r0/git/probes/../instrumentation/events/lttng-module/../../../probes/define_trace.h:148:0,
|                  from /home/pokybuild/yocto-autobuilder/yocto-slave/nightly-x86-64-lsb/build/build/tmp/work/qemux86_64-poky-linux/lttng-modules/2.4.1-r0/git/probes/../instrumentation/events/lttng-module/block.h:936,
|                  from /home/pokybuild/yocto-autobuilder/yocto-slave/nightly-x86-64-lsb/build/build/tmp/work/qemux86_64-poky-linux/lttng-modules/2.4.1-r0/git/probes/lttng-probe-block.c:42:
| /home/pokybuild/yocto-autobuilder/yocto-slave/nightly-x86-64-lsb/build/build/tmp/work/qemux86_64-poky-linux/lttng-modules/2.4.1-r0/git/probes/../instrumentation/events/lttng-module/../../../probes/lttng-events.h:151:6: error: conflicting types for &apos;trace_block_rq_complete&apos;
|  void trace_##_name(_proto);
|       ^
| /home/pokybuild/yocto-autobuilder/yocto-slave/nightly-x86-64-lsb/build/build/tmp/work/qemux86_64-poky-linux/lttng-modules/2.4.1-r0/git/probes/../instrumentation/events/lttng-module/../../../probes/lttng-events.h:117:2: note: in expansion of macro &apos;DEFINE_EVENT_MAP&apos;
|   DEFINE_EVENT_MAP(template, name, name, PARAMS(proto), PARAMS(args))
|   ^
| /home/pokybuild/yocto-autobuilder/yocto-slave/nightly-x86-64-lsb/build/build/tmp/work/qemux86_64-poky-linux/lttng-modules/2.4.1-r0/git/probes/../instrumentation/events/lttng-module/../../../probes/../instrumentation/events/lttng-module/block.h:235:1: note: in expansion of macro &apos;DEFINE_EVENT&apos;
|  DEFINE_EVENT(block_rq_with_error, block_rq_complete,
|  ^
| In file included from include/linux/module.h:18:0,
|                  from /home/pokybuild/yocto-autobuilder/yocto-slave/nightly-x86-64-lsb/build/build/tmp/work/qemux86_64-poky-linux/lttng-modules/2.4.1-r0/git/probes/lttng-probe-block.c:23:
| include/linux/tracepoint.h:168:21: note: previous definition of &apos;trace_block_rq_complete&apos; was here
|   static inline void trace_##name(proto)    \
|                      ^
| include/linux/tracepoint.h:265:3: note: in expansion of macro &apos;__DECLARE_TRACE&apos;
|    __DECLARE_TRACE(name, PARAMS(proto), PARAMS(args), 1, \
|    ^
| include/linux/tracepoint.h:399:2: note: in expansion of macro &apos;DECLARE_TRACE&apos;
|   DECLARE_TRACE(name, PARAMS(proto), PARAMS(args))
|   ^
| include/trace/events/block.h:143:1: note: in expansion of macro &apos;TRACE_EVENT&apos;
|  TRACE_EVENT(block_rq_complete,
|  ^
| scripts/Makefile.build:314: recipe for target &apos;/home/pokybuild/yocto-autobuilder/yocto-slave/nightly-x86-64-lsb/build/build/tmp/work/qemux86_64-poky-linux/lttng-modules/2.4.1-r0/git/probes/lttng-probe-block.o&apos; failed
| make[3]: *** [/home/pokybuild/yocto-autobuilder/yocto-slave/nightly-x86-64-lsb/build/build/tmp/work/qemux86_64-poky-linux/lttng-modules/2.4.1-r0/git/probes/lttng-probe-block.o] Error 1
| scripts/Makefile.build:455: recipe for target &apos;/home/pokybuild/yocto-autobuilder/yocto-slave/nightly-x86-64-lsb/build/build/tmp/work/qemux86_64-poky-linux/lttng-modules/2.4.1-r0/git/probes&apos; failed
| make[2]: *** [/home/pokybuild/yocto-autobuilder/yocto-slave/nightly-x86-64-lsb/build/build/tmp/work/qemux86_64-poky-linux/lttng-modules/2.4.1-r0/git/probes] Error 2
| Makefile:1274: recipe for target &apos;_module_/home/pokybuild/yocto-autobuilder/yocto-slave/nightly-x86-64-lsb/build/build/tmp/work/qemux86_64-poky-linux/lttng-modules/2.4.1-r0/git&apos; failed
| make[1]: *** [_module_/home/pokybuild/yocto-autobuilder/yocto-slave/nightly-x86-64-lsb/build/build/tmp/work/qemux86_64-poky-linux/lttng-modules/2.4.1-r0/git] Error 2
| make[1]: Leaving directory &apos;/home/pokybuild/yocto-autobuilder/yocto-slave/nightly-x86-64-lsb/build/build/tmp/sysroots/qemux86-64/usr/src/kernel&apos;
| Makefile:51: recipe for target &apos;default&apos; failed
| make: *** [default] Error 2
| ERROR: oe_runmake failed
| WARNING: /home/pokybuild/yocto-autobuilder/yocto-slave/nightly-x86-64-lsb/build/build/tmp/work/qemux86_64-poky-linux/lttng-modules/2.4.1-r0/temp/run.do_compile.14990:1 exit 1 from
|   exit 1
| ERROR: Function failed: do_compile (log file is located at /home/pokybuild/yocto-autobuilder/yocto-slave/nightly-x86-64-lsb/build/build/tmp/work/qemux86_64-poky-linux/lttng-modules/2.4.1-r0/temp/log.do_compile.14990)
NOTE: recipe lttng-modules-2.4.1-r0: task do_compile: Failed
ERROR: Task 3885 (/home/pokybuild/yocto-autobuilder/yocto-slave/nightly-x86-64-lsb/build/meta/recipes-kernel/lttng/lttng-modules_2.4.1.bb, do_compile) failed with exit code &apos;1&apos;</thetext>
  </long_desc><long_desc isprivate="0" >
    <commentid>44045</commentid>
    <comment_count>1</comment_count>
    <who name="Bruce Ashfield">bruce.ashfield</who>
    <bug_when>2014-06-18 00:42:15 +0000</bug_when>
    <thetext>Richard already reported this, and I&apos;m fixing it right now. So I&apos;ll grab this.</thetext>
  </long_desc><long_desc isprivate="0" >
    <commentid>44101</commentid>
    <comment_count>2</comment_count>
    <who name="Richard Purdie">richard.purdie</who>
    <bug_when>2014-06-19 14:50:25 +0000</bug_when>
    <thetext>http://git.yoctoproject.org/cgit.cgi/poky/commit/?id=2934b25a37b6d1d09b6c6853959530be414931cb</thetext>
  </long_desc>
      
      

    </bug>

</bugzilla>