<?xml version="1.0" encoding="UTF-8" standalone="yes" ?>
<!DOCTYPE bugzilla SYSTEM "https://bugzilla.yoctoproject.org/page.cgi?id=bugzilla.dtd">

<bugzilla version="5.0.6"
          urlbase="https://bugzilla.yoctoproject.org/"
          
          maintainer="it-coreprojects-helpdesk@linuxfoundation.org"
>

    <bug>
          <bug_id>730</bug_id>
          
          <creation_ts>2011-02-16 22:15:04 +0000</creation_ts>
          <short_desc>OpenJade fails to build gtk+ documentation correctly</short_desc>
          <delta_ts>2011-07-21 19:37:15 +0000</delta_ts>
          <reporter_accessible>1</reporter_accessible>
          <cclist_accessible>1</cclist_accessible>
          <classification_id>7</classification_id>
          <classification>Build System, Metadata &amp; Runtime</classification>
          <product>OE-Core</product>
          <component>devtools / tool chain</component>
          <version>1.0</version>
          <rep_platform>x86</rep_platform>
          <op_sys>Multiple</op_sys>
          <bug_status>VERIFIED</bug_status>
          <resolution>FIXED</resolution>
          
          
          <bug_file_loc></bug_file_loc>
          <status_whiteboard></status_whiteboard>
          <keywords></keywords>
          <priority>High</priority>
          <bug_severity>normal</bug_severity>
          <target_milestone>1.0 M4</target_milestone>
          
          
          <everconfirmed>1</everconfirmed>
          <reporter name="Saul Wold">sgw</reporter>
          <assigned_to name="Scott Garman">scott.a.garman</assigned_to>
          <cc>meta.mr.watcher</cc>
    
    <cc>meta.watcher</cc>
          
          
          <cf_os>---</cf_os>
          <cf_regression_type>---</cf_regression_type>
          
          <cf_docchange>---</cf_docchange>

      

      

      

          <comment_sort_order>oldest_to_newest</comment_sort_order>  
          <long_desc isprivate="0" >
    <commentid>11829</commentid>
    <comment_count>0</comment_count>
    <who name="Saul Wold">sgw</who>
    <bug_when>2011-02-16 22:15:04 +0000</bug_when>
    <thetext>The following error occurs when attempting to build documentation for GTK+.

Using catalogs: /vol/1/sgw/autobuilder/poky-slave/poky-full-ia/build/build/tmp/sysroots/x86_64-linux/etc/sgml/catalog
Using stylesheet: /vol/1/sgw/autobuilder/poky-slave/poky-full-ia/build/build/tmp/sysroots/x86_64-linux/usr/share/sgml/docbook/utils-0.6.14/docbook-utils.dsl#html
Working on: /vol/1/sgw/autobuilder/poky-slave/poky-full-ia/build/build/tmp/work/i586-poky-linux/gtk+-2.22.1-r1/gtk+-2.22.1/docs/tutorial/gtk-tut.sgml
jade:E: cannot open &quot;/vol/1/sgw/autobuilder/poky-slave/poky-full-ia/build/build/tmp/sysroots/x86_64-linux/usr/share/builtins.dsl&quot; (No such file or directory)
jade:E: cannot find &quot;html/docbook.dsl&quot;; tried &quot;/vol/1/sgw/autobuilder/poky-slave/poky-full-ia/build/build/tmp/sysroots/x86_64-linux/usr/share/sgml/docbook/dsssl-stylesheets-1.79/html/docbook.dsl&quot;, &quot;/vol/1/sgw/autobuilder/poky-slave/poky-full-ia/build/build/tmp/sysroots/x86_64-linux/usr/share/sgml/html/docbook.dsl&quot;
jade:E: specification document does not have the DSSSL architecture as a base architecture

Also, note:
mv: cannot stat `gtk-tut&apos;: No such file or directory
mkdir: cannot create directory `html/images&apos;: No such file or directory
cp: target `html/images&apos; is not a directory
make[3]: *** [html] Error 1
make[3]: Leaving directory `/vol/1/sgw/autobuilder/poky-slave/poky-full-ia/build/build/tmp/work/i586-poky-linux/gtk+-2.22.1-r1/gtk+-2.22.1/docs/tutorial&apos;
make[2]: *** [all-recursive] Error 1
make[2]: Leaving directory `/vol/1/sgw/autobuilder/poky-slave/poky-full-ia/build/build/tmp/work/i586-poky-linux/gtk+-2.22.1-r1/gtk+-2.22.1/docs&apos;
make[1]: *** [all-recursive] Error 1
make[1]: Leaving directory `/vol/1/sgw/autobuilder/poky-slave/poky-full-ia/build/build/tmp/work/i586-poky-linux/gtk+-2.22.1-r1/gtk+-2.22.1&apos;
make: *** [all] Error 2</thetext>
  </long_desc><long_desc isprivate="0" >
    <commentid>11843</commentid>
    <comment_count>1</comment_count>
    <who name="Saul Wold">sgw</who>
    <bug_when>2011-02-17 17:46:22 +0000</bug_when>
    <thetext>http://git.pokylinux.org/cgit/cgit.cgi/poky/commit/?id=40ed2718177b022c85fe9cd54e1cb7b424023302

http://git.pokylinux.org/cgit/cgit.cgi/poky/commit/?id=0bc7de5179c9844315f303aa6e0f237ed8586a87

http://git.pokylinux.org/cgit/cgit.cgi/poky/commit/?id=6547f62fb3da7094fd9aa85c3777b17aa38700a3

http://git.pokylinux.org/cgit/cgit.cgi/poky/commit/?id=561c7a8f654871a8e738d24a2aeec556d6b52f8a</thetext>
  </long_desc><long_desc isprivate="0" >
    <commentid>14867</commentid>
    <comment_count>2</comment_count>
    <who name="Scott Garman">scott.a.garman</who>
    <bug_when>2011-07-21 19:37:15 +0000</bug_when>
    <thetext>Verified that the package is now generating documentation with the latest documentation audit.</thetext>
  </long_desc>
      
      

    </bug>

</bugzilla>