<?xml version="1.0" encoding="UTF-8" standalone="yes" ?>
<!DOCTYPE bugzilla SYSTEM "https://bugzilla.yoctoproject.org/page.cgi?id=bugzilla.dtd">

<bugzilla version="5.0.6"
          urlbase="https://bugzilla.yoctoproject.org/"
          
          maintainer="it-coreprojects-helpdesk@linuxfoundation.org"
>

    <bug>
          <bug_id>7447</bug_id>
          
          <creation_ts>2015-03-11 19:05:17 +0000</creation_ts>
          <short_desc>puzzles fails to compile with x32 ABI</short_desc>
          <delta_ts>2015-05-27 11:47:04 +0000</delta_ts>
          <reporter_accessible>1</reporter_accessible>
          <cclist_accessible>1</cclist_accessible>
          <classification_id>7</classification_id>
          <classification>Build System, Metadata &amp; Runtime</classification>
          <product>OE-Core</product>
          <component>core</component>
          <version>1.8</version>
          <rep_platform>x86</rep_platform>
          <op_sys>x86_64</op_sys>
          <bug_status>VERIFIED</bug_status>
          <resolution>FIXED</resolution>
          
          
          <bug_file_loc></bug_file_loc>
          <status_whiteboard></status_whiteboard>
          <keywords></keywords>
          <priority>Medium</priority>
          <bug_severity>normal</bug_severity>
          <target_milestone>1.9</target_milestone>
          
          <blocked>3437</blocked>
          <everconfirmed>1</everconfirmed>
          <reporter name="Mariano Lopez">mariano.lopez</reporter>
          <assigned_to name="Aníbal Limón">anibal.limon</assigned_to>
          <cc>anibal.limon</cc>
    
    <cc>cristina-danielax.agurida</cc>
    
    <cc>meta.mr.watcher</cc>
    
    <cc>meta.watcher</cc>
    
    <cc>sgw</cc>
          
          <qa_contact name="Cristina Agurida">cristina-danielax.agurida</qa_contact>
          <cf_os>---</cf_os>
          <cf_regression_type>---</cf_regression_type>
          
          <cf_docchange>No (bug/feature does not impact docs)</cf_docchange>

      

      

      

          <comment_sort_order>oldest_to_newest</comment_sort_order>  
          <long_desc isprivate="0" >
    <commentid>49376</commentid>
    <comment_count>0</comment_count>
    <who name="Mariano Lopez">mariano.lopez</who>
    <bug_when>2015-03-11 19:05:17 +0000</bug_when>
    <thetext>Puzzles fails to compile with x32 ABI

| x86_64-poky-linux-gnux32-gcc  -mx32 --sysroot=/home/mlopezva/poky/qemux86-64-x32/tmp/sysroots/qemux86-64 -pthread -I/home/mlopezva/poky/qemux86-64-x32/tmp/sysroots/qemux86-64/usr/include/gtk-2.0 -I/home/mlopezva/poky/qemux86-64-x32/tmp/sysroots/qemux86-64/usr/libx32/gtk-2.0/include -I/home/mlopezva/poky/qemux86-64-x32/tmp/sysroots/qemux86-64/usr/include/pango-1.0 -I/home/mlopezva/poky/qemux86-64-x32/tmp/sysroots/qemux86-64/usr/include/atk-1.0 -I/home/mlopezva/poky/qemux86-64-x32/tmp/sysroots/qemux86-64/usr/include/cairo -I/home/mlopezva/poky/qemux86-64-x32/tmp/sysroots/qemux86-64/usr/include/pixman-1 -I/home/mlopezva/poky/qemux86-64-x32/tmp/sysroots/qemux86-64/usr/include/libpng16 -I/home/mlopezva/poky/qemux86-64-x32/tmp/sysroots/qemux86-64/usr/include/gdk-pixbuf-2.0 -I/home/mlopezva/poky/qemux86-64-x32/tmp/sysroots/qemux86-64/usr/include/libpng16 -I/home/mlopezva/poky/qemux86-64-x32/tmp/sysroots/qemux86-64/usr/include/pango-1.0 -I/home/mlopezva/poky/qemux86-64-x32/tmp/sysroots/qemux86-64/usr/include/harfbuzz -I/home/mlopezva/poky/qemux86-64-x32/tmp/sysroots/qemux86-64/usr/include/pango-1.0 -I/home/mlopezva/poky/qemux86-64-x32/tmp/sysroots/qemux86-64/usr/include/glib-2.0 -I/home/mlopezva/poky/qemux86-64-x32/tmp/sysroots/qemux86-64/usr/libx32/glib-2.0/include -I/home/mlopezva/poky/qemux86-64-x32/tmp/sysroots/qemux86-64/home/mlopezva/poky/qemux86-64-x32/tmp/sysroots/qemux86-64/usr/include/freetype2 -I/home/mlopezva/poky/qemux86-64-x32/tmp/sysroots/qemux86-64/usr/include/freetype2   -O2 -pipe -g -feliminate-unused-debug-types -Wall -Werror -ansi -pedantic  -Wl,-O1 -Wl,--hash-style=gnu  -o keensolver dsf.o malloc.o maxflow.o misc.o nullfe.o random.o tree234.o libkeen2_a-keen.o liblatin6_a-latin.o -lm
| x86_64-poky-linux-gnux32-ranlib libkeen2.a
| cc1: all warnings being treated as errors
| make[1]: *** [libsignpos2_a-signpost.o] Error 1
| make[1]: *** Waiting for unfinished jobs....
| cc1: all warnings being treated as errors
| make[1]: *** [libmagnets2_a-magnets.o] Error 1
| make[1]: Leaving directory `/home/mlopezva/poky/qemux86-64-x32/tmp/work/x86_64_x32-poky-linux-gnux32/puzzles/r10116-r0/puzzles&apos;
| make: *** [all] Error 2
| ERROR: oe_runmake failed
| WARNING: /home/mlopezva/poky/qemux86-64-x32/tmp/work/x86_64_x32-poky-linux-gnux32/puzzles/r10116-r0/temp/run.do_compile.27607:1 exit 1 from
|   exit 1
| ERROR: Function failed: do_compile (log file is located at /home/mlopezva/poky/qemux86-64-x32/tmp/work/x86_64_x32-poky-linux-gnux32/puzzles/r10116-r0/temp/log.do_compile.27607)
ERROR: Task 6 (/home/mlopezva/poky/meta/recipes-sato/puzzles/puzzles_r10116.bb, do_compile) failed with exit code &apos;1&apos;</thetext>
  </long_desc><long_desc isprivate="0" >
    <commentid>49664</commentid>
    <comment_count>1</comment_count>
    <who name="Aníbal Limón">anibal.limon</who>
    <bug_when>2015-03-23 16:15:23 +0000</bug_when>
    <thetext>Merge at,

http://git.yoctoproject.org/cgit/cgit.cgi/poky/commit/?id=d342810cd545accffe26c218e4fa80431802185f</thetext>
  </long_desc><long_desc isprivate="0" >
    <commentid>51295</commentid>
    <comment_count>2</comment_count>
    <who name="Cristina Agurida">cristina-danielax.agurida</who>
    <bug_when>2015-05-27 11:47:04 +0000</bug_when>
    <thetext>Verified on master: 5170177719a93a69cc6c7c1218b3f26eed82d6e0</thetext>
  </long_desc>
      
      

    </bug>

</bugzilla>