<?xml version="1.0" encoding="UTF-8" standalone="yes" ?>
<!DOCTYPE bugzilla SYSTEM "https://bugzilla.yoctoproject.org/page.cgi?id=bugzilla.dtd">

<bugzilla version="5.0.6"
          urlbase="https://bugzilla.yoctoproject.org/"
          
          maintainer="it-coreprojects-helpdesk@linuxfoundation.org"
>

    <bug>
          <bug_id>748</bug_id>
          
          <creation_ts>2011-02-21 17:47:36 +0000</creation_ts>
          <short_desc>docbook-utils-native-0.6.14-r1: task do_compile: Failed</short_desc>
          <delta_ts>2011-02-28 10:58:34 +0000</delta_ts>
          <reporter_accessible>1</reporter_accessible>
          <cclist_accessible>1</cclist_accessible>
          <classification_id>7</classification_id>
          <classification>Build System, Metadata &amp; Runtime</classification>
          <product>Meta-yocto</product>
          <component>meta-yocto</component>
          <version>1.0</version>
          <rep_platform>x86</rep_platform>
          <op_sys>Multiple</op_sys>
          <bug_status>VERIFIED</bug_status>
          <resolution>FIXED</resolution>
          
          
          <bug_file_loc></bug_file_loc>
          <status_whiteboard></status_whiteboard>
          <keywords></keywords>
          <priority>High</priority>
          <bug_severity>critical</bug_severity>
          <target_milestone>1.0 M4</target_milestone>
          
          <blocked>741</blocked>
          <everconfirmed>1</everconfirmed>
          <reporter name="Dexuan Cui">dexuan.cui</reporter>
          <assigned_to name="Scott Garman">scott.a.garman</assigned_to>
          <cc>liping.ke</cc>
    
    <cc>poky.bs.watcher</cc>
    
    <cc>poky.watcher</cc>
    
    <cc>richard.purdie</cc>
    
    <cc>sgw</cc>
          
          
          <cf_os>---</cf_os>
          <cf_regression_type>---</cf_regression_type>
          <cf_verified>Program Management</cf_verified>
          <cf_docchange>---</cf_docchange>

      

      

      

          <comment_sort_order>oldest_to_newest</comment_sort_order>  
          <long_desc isprivate="0" >
    <commentid>11903</commentid>
    <comment_count>0</comment_count>
    <who name="Dexuan Cui">dexuan.cui</who>
    <bug_when>2011-02-21 17:47:36 +0000</bug_when>
    <thetext>A snippet about the log: http://autobuilder.pokylinux.org:8010/builders/nightly-internal/builds/59/steps/shell_1/logs/stdio

OE Build Configuration:
BB_VERSION        = &quot;1.11.0&quot;
METADATA_BRANCH   = &quot;master&quot;
METADATA_REVISION = &quot;e79a8a6d1752d43746aa0cc09b8c20bfeabb2d95&quot;
TARGET_ARCH       = &quot;i586&quot;
TARGET_OS         = &quot;linux&quot;
MACHINE           = &quot;qemux86&quot;
DISTRO            = &quot;poky&quot;
DISTRO_VERSION    = &quot;0.9+snapshot-20110221&quot;
TARGET_FPU        = &quot;&quot;

...

| jade:../ERROR: Function &apos;do_compile&apos; failed (see /builds2/pokybuilds/nightly-internal/build/build/tmp/work/x86_64-linux/docbook-utils-native-0.6.14-r1/temp/log.do_compile.13036 for further information)
| ../doc/refentry/jw.sgml:60:12:E: element &quot;ARG&quot; undefined
| jade:../../doc/refentry/jw.sgml:60:20:E: element &quot;OPTION&quot; undefined
| jade:../../doc/refentry/jw.sgml:60:48:E: element &quot;REPLACEABLE&quot; undefined
| jade:../../doc/refentry/jw.sgml:61:18:E: element &quot;SBR&quot; undefined
| jade:../../doc/refentry/jw.sgml:63:25:E: element &quot;GROUP&quot; undefined
| jade:../../doc/refentry/jw.sgml:64:12:E: element &quot;ARG&quot; undefined
| jade:../../doc/refentry/jw.sgml:64:20:E: element &quot;OPTION&quot; undefined
| jade:../../doc/refentry/jw.sgml:64:45:E: element &quot;REPLACEABLE&quot; undefined
| jade:../../doc/refentry/jw.sgml:65:12:E: element &quot;ARG&quot; undefined
| jade:../../doc/refentry/jw.sgml:65:20:E: element &quot;OPTION&quot; undefined
| jade:../../doc/refentry/jw.sgml:65:53:E: element &quot;REPLACEABLE&quot; undefined
| jade:../../doc/refentry/jw.sgml:66:18:E: element &quot;SBR&quot; undefined
| jade:../../doc/refentry/jw.sgml:68:25:E: element &quot;GROUP&quot; undefined
| jade:../../doc/refentry/jw.sgml:69:12:E: element &quot;ARG&quot; undefined
| jade:../../doc/refentry/jw.sgml:69:20:E: element &quot;OPTION&quot; undefined
| jade:../../doc/refentry/jw.sgml:69:45:E: element &quot;REPLACEABLE&quot; undefined
| jade:../../doc/refentry/jw.sgml:70:12:E: element &quot;ARG&quot; undefined
| jade:../../doc/refentry/jw.sgml:70:20:E: element &quot;OPTION&quot; undefined
| jade:../../doc/refentry/jw.sgml:70:51:E: element &quot;REPLACEABLE&quot; undefined
| jade:../../doc/refentry/jw.sgml:71:18:E: element &quot;SBR&quot; undefined
| jade:../../doc/refentry/jw.sgml:73:25:E: element &quot;GROUP&quot; undefined
| jade:../../doc/refentry/jw.sgml:74:12:E: element &quot;ARG&quot; undefined
| jade:../../doc/refentry/jw.sgml:74:20:E: element &quot;OPTION&quot; undefined
| jade:../../doc/refentry/jw.sgml:74:45:E: element &quot;REPLACEABLE&quot; undefined
| jade:../../doc/refentry/jw.sgml:75:12:E: element &quot;ARG&quot; undefined
| jade:../../doc/refentry/jw.sgml:75:20:E: element &quot;OPTION&quot; undefined
| jade:../../doc/refentry/jw.sgml:75:51:E: element &quot;REPLACEABLE&quot; undefined
| jade:../../doc/refentry/jw.sgml:76:18:E: element &quot;SBR&quot; undefined
| jade:../../doc/refentry/jw.sgml:78:18:E: there is no attribute &quot;CHOICE&quot;
| jade:../../doc/refentry/jw.sgml:78:23:E: element &quot;ARG&quot; undefined
| jade:../../doc/refentry/jw.sgml:78:31:E: element &quot;OPTION&quot; undefined
| jade:../../doc/refentry/jw.sgml:79:20:E: element &quot;REPLACEABLE&quot; undefined
| jade:../../doc/refentry/jw.sgml:79:57:E: element &quot;REPLACEABLE&quot; undefined
| jade:../../doc/refentry/jw.sgml:79:88:E: element &quot;SBR&quot; undefined
| jade:../../doc/refentry/jw.sgml:81:25:E: element &quot;GROUP&quot; undefined
| jade:../../doc/refentry/jw.sgml:82:12:E: element &quot;ARG&quot; undefined
| jade:../../doc/refentry/jw.sgml:82:20:E: element &quot;OPTION&quot; undefined
| jade:I: maximum number of errors (200) reached; change with -E option
| make[2]: *** [intro-sgmldiff.html] Error 1
| make[2]: *** Waiting for unfinished jobs....
| make[2]: *** [api.html] Error 1
| make[2]: *** [introduction.html] Error 1
| make[2]: *** [frontend-spec.html] Error 1
| make[2]: *** [backend-spec.html] Error 1
| make[2]: *** [jw.html] Error 1
| make[2]: *** [helpers.html] Error 1
| make[2]: *** [fdl.html] Error 1
| make[2]: *** [intro-jw.html] Error 1
| make[2]: *** [sgmldiff.html] Error 1
| make[2]: *** [index.html] Error 1
| make[2]: *** [docbook2man.html] Error 1
| make[2]: *** [docbook2texi.html] Error 1
| make[2]: Leaving directory `/builds2/pokybuilds/nightly-internal/build/build/tmp/work/x86_64-linux/docbook-utils-native-0.6.14-r1/docbook-utils-0.6.14/doc/HTML&apos;
| make[1]: *** [all-recursive] Error 1
| make[1]: Leaving directory `/builds2/pokybuilds/nightly-internal/build/build/tmp/work/x86_64-linux/docbook-utils-native-0.6.14-r1/docbook-utils-0.6.14/doc&apos;
| make: *** [all-recursive] Error 1
| FATAL: oe_runmake failed
NOTE: package docbook-utils-native-0.6.14-r1: task do_compile: Failed
NOTE: package module-init-tools-3.12-r1: task do_patch: Succeeded
ERROR: Task 6622 (/builds2/pokybuilds/nightly-internal/build/meta/recipes-devtools/docbook-utils/docbook-utils-native_0.6.14.bb, do_compile) failed with exit code &apos;1&apos;
NOTE: Running task 2249 of 8568 (ID: 7821, /builds2/pokybuilds/nightly</thetext>
  </long_desc><long_desc isprivate="0" >
    <commentid>11929</commentid>
    <comment_count>1</comment_count>
    <who name="Joshua Lock - Disabled">josh</who>
    <bug_when>2011-02-22 04:11:31 +0000</bug_when>
    <thetext>*** Bug 740 has been marked as a duplicate of this bug. ***</thetext>
  </long_desc><long_desc isprivate="0" >
    <commentid>11957</commentid>
    <comment_count>2</comment_count>
    <who name="Scott Garman">scott.a.garman</who>
    <bug_when>2011-02-22 15:05:47 +0000</bug_when>
    <thetext>This error indicates that a DTD or entity definition is missing. It is missing because in the native sysroot, etc/sgml/catalog only contains:

CATALOG .../tmp/sysroots/x86_64-linux/etc/sgml/dsssl-docbook-stylesheets.cat
CATALOG .../tmp/sysroots/x86_64-linux/etc/sgml/sgml-docbook.cat
CATALOG .../tmp/sysroots/x86_64-linux/etc/sgml/openjade-1.3.2.cat

The catalog *should* contain:

CATALOG .../tmp/sysroots/x86_64-linux/etc/sgml/sgml-ent.cat
CATALOG .../tmp/sysroots/x86_64-linux/etc/sgml/sgml-docbook.cat
CATALOG .../tmp/sysroots/x86_64-linux/etc/sgml/sgml-docbook-dtd-3.1.cat
CATALOG .../tmp/sysroots/x86_64-linux/etc/sgml/dsssl-docbook-stylesheets.cat
CATALOG .../tmp/sysroots/x86_64-linux/etc/sgml/openjade-1.3.2.cat

I notice that sgml-ent.cat and sgml-docbook-dtd-3.1.cat exist in etc/sgml/, and that they have older timestamps than the catalog file. 

So there is an issue with how install-catalog is being run. Possibly a race condition. I am currently investigating.</thetext>
  </long_desc><long_desc isprivate="0" >
    <commentid>12009</commentid>
    <comment_count>3</comment_count>
    <who name="Scott Garman">scott.a.garman</who>
    <bug_when>2011-02-23 09:47:48 +0000</bug_when>
    <thetext>This should be fixed with commit series leading up to and including 	dca876b8f611704a238842c9e4db293d1a1be247

http://git.pokylinux.org/cgit/cgit.cgi/poky/commit/?id=dca876b8f611704a238842c9e4db293d1a1be247</thetext>
  </long_desc><long_desc isprivate="0" >
    <commentid>12106</commentid>
    <comment_count>4</comment_count>
    <who name="Dexuan Cui">dexuan.cui</who>
    <bug_when>2011-02-24 22:59:17 +0000</bug_when>
    <thetext>(In reply to comment #3)
&gt; This should be fixed with commit series leading up to and including    
&gt; dca876b8f611704a238842c9e4db293d1a1be247
&gt; http://git.pokylinux.org/cgit/cgit.cgi/poky/commit/?id=dca876b8f611704a238842c9e4db293d1a1be247

I don&apos;t meet with the bug now.</thetext>
  </long_desc>
      
      

    </bug>

</bugzilla>