<?xml version="1.0" encoding="UTF-8" standalone="yes" ?>
<!DOCTYPE bugzilla SYSTEM "https://bugzilla.yoctoproject.org/page.cgi?id=bugzilla.dtd">

<bugzilla version="5.0.6"
          urlbase="https://bugzilla.yoctoproject.org/"
          
          maintainer="it-coreprojects-helpdesk@linuxfoundation.org"
>

    <bug>
          <bug_id>8270</bug_id>
          
          <creation_ts>2015-09-08 16:37:59 +0000</creation_ts>
          <short_desc>systemd testing fails date test</short_desc>
          <delta_ts>2015-10-08 07:48:25 +0000</delta_ts>
          <reporter_accessible>1</reporter_accessible>
          <cclist_accessible>1</cclist_accessible>
          <classification_id>10</classification_id>
          <classification>QA/Testing</classification>
          <product>Runtime Testing</product>
          <component>general</component>
          <version>unspecified</version>
          <rep_platform>x86</rep_platform>
          <op_sys>Multiple</op_sys>
          <bug_status>VERIFIED</bug_status>
          <resolution>FIXED</resolution>
          
          
          <bug_file_loc></bug_file_loc>
          <status_whiteboard></status_whiteboard>
          <keywords></keywords>
          <priority>Medium+</priority>
          <bug_severity>normal</bug_severity>
          <target_milestone>1.9 M3</target_milestone>
          
          
          <everconfirmed>1</everconfirmed>
          <reporter name="Beth Flanagan">elizabeth.flanagan</reporter>
          <assigned_to name="Ross Burton">ross.burton</assigned_to>
          <cc>bogdanx.a.voiculescu</cc>
    
    <cc>richard.purdie</cc>
    
    <cc>ross.burton</cc>
          
          <qa_contact name="Bogdan Alexandru Voiculescu">bogdanx.a.voiculescu</qa_contact>
          <cf_os>---</cf_os>
          <cf_regression_type>---</cf_regression_type>
          
          <cf_docchange>No (bug/feature does not impact docs)</cf_docchange>

      

      

      

          <comment_sort_order>oldest_to_newest</comment_sort_order>  
          <long_desc isprivate="0" >
    <commentid>53851</commentid>
    <comment_count>0</comment_count>
    <who name="Beth Flanagan">elizabeth.flanagan</who>
    <bug_when>2015-09-08 16:37:59 +0000</bug_when>
    <thetext>https://autobuilder.yoctoproject.org/main/builders/nightly-qa-systemd/builds/480/steps/Running%20Sanity%20Tests/logs/stdio

| ======================================================================
| FAIL: test_date (oeqa.runtime.date.DateTest)
| ----------------------------------------------------------------------
| Traceback (most recent call last):
|   File &quot;/home/pokybuild/yocto-autobuilder/yocto-worker/nightly-qa-systemd/build/meta/lib/oeqa/utils/decorators.py&quot;, line 102, in wrapped_f
|     return func(*args)
|   File &quot;/home/pokybuild/yocto-autobuilder/yocto-worker/nightly-qa-systemd/build/meta/lib/oeqa/utils/decorators.py&quot;, line 90, in wrapped_f
|     return f(*args)
|   File &quot;/home/pokybuild/yocto-autobuilder/yocto-worker/nightly-qa-systemd/build/meta/lib/oeqa/runtime/date.py&quot;, line 20, in test_date
|     self.assertTrue(p, msg=&quot;The date was not set correctly, output: %s&quot; % output)
| AssertionError: None is not true : The date was not set correctly, output: Mon, 07 Sep 2015 16:55:39 +0000
| 
| ----------------------------------------------------------------------
| Ran 53 tests in 894.738s
| 
| FAILED (failures=1, skipped=1)</thetext>
  </long_desc><long_desc isprivate="0" >
    <commentid>53879</commentid>
    <comment_count>1</comment_count>
    <who name="Richard Purdie">richard.purdie</who>
    <bug_when>2015-09-09 13:09:11 +0000</bug_when>
    <thetext>This only happens with the systemd upgrade in master-next from Khem</thetext>
  </long_desc><long_desc isprivate="0" >
    <commentid>53938</commentid>
    <comment_count>2</comment_count>
    <who name="Ross Burton">ross.burton</who>
    <bug_when>2015-09-10 14:42:52 +0000</bug_when>
    <thetext>Fix for the test case sent.</thetext>
  </long_desc><long_desc isprivate="0" >
    <commentid>54374</commentid>
    <comment_count>3</comment_count>
    <who name="Ross Burton">ross.burton</who>
    <bug_when>2015-09-21 12:55:45 +0000</bug_when>
    <thetext>Fixed in oe-core 5334f1b1e9363fa9c128289b51ade55c7ae1a0a3.</thetext>
  </long_desc><long_desc isprivate="0" >
    <commentid>55054</commentid>
    <comment_count>4</comment_count>
    <who name="Bogdan Alexandru Voiculescu">bogdanx.a.voiculescu</who>
    <bug_when>2015-10-08 07:48:25 +0000</bug_when>
    <thetext>Verified: https://autobuilder.yoctoproject.org/main/builders/nightly-qa-systemd/builds/505/steps/Running%20Sanity%20Tests/logs/stdio

meta-yocto-bsp    = &quot;master-next:f561c6aaedf74c305e769d66ce088ade565b2196&quot;</thetext>
  </long_desc>
      
      

    </bug>

</bugzilla>