<?xml version="1.0" encoding="UTF-8" standalone="yes" ?>
<!DOCTYPE bugzilla SYSTEM "https://bugzilla.yoctoproject.org/page.cgi?id=bugzilla.dtd">

<bugzilla version="5.0.6"
          urlbase="https://bugzilla.yoctoproject.org/"
          
          maintainer="it-coreprojects-helpdesk@linuxfoundation.org"
>

    <bug>
          <bug_id>8381</bug_id>
          
          <creation_ts>2015-09-23 12:40:47 +0000</creation_ts>
          <short_desc>connman oe-selftest tests failed - connmand not running</short_desc>
          <delta_ts>2015-10-23 12:23:34 +0000</delta_ts>
          <reporter_accessible>1</reporter_accessible>
          <cclist_accessible>1</cclist_accessible>
          <classification_id>7</classification_id>
          <classification>Build System, Metadata &amp; Runtime</classification>
          <product>OE-Core</product>
          <component>connectivity</component>
          <version>2.0</version>
          <rep_platform>x86</rep_platform>
          <op_sys>x86</op_sys>
          <bug_status>VERIFIED</bug_status>
          <resolution>WORKSFORME</resolution>
          
          
          <bug_file_loc></bug_file_loc>
          <status_whiteboard></status_whiteboard>
          <keywords></keywords>
          <priority>Medium+</priority>
          <bug_severity>normal</bug_severity>
          <target_milestone>2.0</target_milestone>
          
          
          <everconfirmed>1</everconfirmed>
          <reporter name="Paul Eggleton">bluelightning</reporter>
          <assigned_to name="Cristian Iorga">cristian.iorga</assigned_to>
          <cc>alexandru.c.georgescu</cc>
    
    <cc>bogdanx.a.voiculescu</cc>
    
    <cc>meta.mr.watcher</cc>
    
    <cc>meta.watcher</cc>
    
    <cc>ross.burton</cc>
          
          <qa_contact name="Alexandru Georgescu">alexandru.c.georgescu</qa_contact>
          <cf_os>---</cf_os>
          <cf_regression_type>---</cf_regression_type>
          
          <cf_docchange>No (bug/feature does not impact docs)</cf_docchange>

      

      

      

          <comment_sort_order>oldest_to_newest</comment_sort_order>  
          <long_desc isprivate="0" >
    <commentid>54524</commentid>
    <comment_count>0</comment_count>
    <who name="Paul Eggleton">bluelightning</who>
    <bug_when>2015-09-23 12:40:47 +0000</bug_when>
    <thetext>From https://autobuilder.yoctoproject.org/main/builders/nightly-ipk/builds/489/steps/Running%20Sanity%20Tests_2/logs/stdio (https://autobuilder.yoctoproject.org/main/builders/nightly-ipk/builds/489, master-next, ubuntu1204):

------------------ snip ------------------
| ======================================================================
| FAIL: test_connmand_running (oeqa.runtime.connman.ConnmanTest)
| ----------------------------------------------------------------------
| Traceback (most recent call last):
|   File &quot;/home/pokybuild/yocto-autobuilder/yocto-worker/nightly-ipk/build/meta/lib/oeqa/utils/decorators.py&quot;, line 102, in wrapped_f
|     return func(*args)
|   File &quot;/home/pokybuild/yocto-autobuilder/yocto-worker/nightly-ipk/build/meta/lib/oeqa/utils/decorators.py&quot;, line 90, in wrapped_f
|     return f(*args)
|   File &quot;/home/pokybuild/yocto-autobuilder/yocto-worker/nightly-ipk/build/meta/lib/oeqa/runtime/connman.py&quot;, line 31, in test_connmand_running
|     self.fail(&quot;No connmand process running&quot;)
| AssertionError: No connmand process running
| 
| ======================================================================
| FAIL: test_only_one_connmand_in_background (oeqa.runtime.connman.ConnmanTest)
| ----------------------------------------------------------------------
| Traceback (most recent call last):
|   File &quot;/home/pokybuild/yocto-autobuilder/yocto-worker/nightly-ipk/build/meta/lib/oeqa/utils/decorators.py&quot;, line 102, in wrapped_f
|     return func(*args)
|   File &quot;/home/pokybuild/yocto-autobuilder/yocto-worker/nightly-ipk/build/meta/lib/oeqa/runtime/connman.py&quot;, line 45, in test_only_one_connmand_in_background
|     self.assertEqual(0, status, &apos;Failed to find &quot;connmand&quot; process running in background.&apos;)
| AssertionError: 0 != 1 : Failed to find &quot;connmand&quot; process running in background.
------------------ snip ------------------</thetext>
  </long_desc><long_desc isprivate="0" >
    <commentid>55091</commentid>
    <comment_count>1</comment_count>
    <who name="Ross Burton">ross.burton</who>
    <bug_when>2015-10-08 20:19:24 +0000</bug_when>
    <thetext>Transient and impossible to debug without access to the rootfs, which is long gone.  Closing.</thetext>
  </long_desc><long_desc isprivate="0" >
    <commentid>55641</commentid>
    <comment_count>2</comment_count>
    <who name="Alexandru Georgescu">alexandru.c.georgescu</who>
    <bug_when>2015-10-23 06:58:06 +0000</bug_when>
    <thetext>verified as per above comments</thetext>
  </long_desc>
      
      

    </bug>

</bugzilla>