<?xml version="1.0" encoding="UTF-8" standalone="yes" ?>
<!DOCTYPE bugzilla SYSTEM "https://bugzilla.yoctoproject.org/page.cgi?id=bugzilla.dtd">

<bugzilla version="5.0.6"
          urlbase="https://bugzilla.yoctoproject.org/"
          
          maintainer="it-coreprojects-helpdesk@linuxfoundation.org"
>

    <bug>
          <bug_id>8562</bug_id>
          
          <creation_ts>2015-10-23 14:15:53 +0000</creation_ts>
          <short_desc>Fedora 23 image builds fail due to perl bigint library</short_desc>
          <delta_ts>2016-02-08 16:10:01 +0000</delta_ts>
          <reporter_accessible>1</reporter_accessible>
          <cclist_accessible>1</cclist_accessible>
          <classification_id>7</classification_id>
          <classification>Build System, Metadata &amp; Runtime</classification>
          <product>OE-Core</product>
          <component>devtools / tool chain</component>
          <version>2.0</version>
          <rep_platform>All</rep_platform>
          <op_sys>Multiple</op_sys>
          <bug_status>VERIFIED</bug_status>
          <resolution>FIXED</resolution>
          
          
          <bug_file_loc></bug_file_loc>
          <status_whiteboard></status_whiteboard>
          <keywords></keywords>
          <priority>Medium+</priority>
          <bug_severity>normal</bug_severity>
          <target_milestone>2.0.1</target_milestone>
          
          
          <everconfirmed>1</everconfirmed>
          <reporter name="Mihail Stanciu">stanciux.mihail</reporter>
          <assigned_to name="Ross Burton">ross.burton</assigned_to>
          <cc>akuster</cc>
    
    <cc>bogdanx.a.voiculescu</cc>
    
    <cc>daniel.alexandrux.istrate</cc>
    
    <cc>meta.mr.watcher</cc>
    
    <cc>meta.watcher</cc>
    
    <cc>randy.macleod</cc>
    
    <cc>ross.burton</cc>
    
    <cc>samset</cc>
          
          <qa_contact name="Bogdan Alexandru Voiculescu">bogdanx.a.voiculescu</qa_contact>
          <cf_os>---</cf_os>
          <cf_regression_type>Regression (Found by QA test)</cf_regression_type>
          
          <cf_docchange>Yes (doc changes required)</cf_docchange>

      

      

      

          <comment_sort_order>oldest_to_newest</comment_sort_order>  
          <long_desc isprivate="0" >
    <commentid>55674</commentid>
    <comment_count>0</comment_count>
    <who name="Mihail Stanciu">stanciux.mihail</who>
    <bug_when>2015-10-23 14:15:53 +0000</bug_when>
    <thetext>Tested on master: 505a82673ac2487df5ea343a6422c2fc47018831
OS tested: Fedora 23 beta

As part of beta DISTRO testing found that openssl package fails on build with error:

Log data follows:
| DEBUG: Executing shell function do_compile
| NOTE: make -e MAKEFLAGS=
| making all in crypto...
| make[1]: Entering directory &apos;/home/autobuilder/yocto-autobuilder/yocto-worker/nightly-oe-selftest/build/build/tmp/work/x86_64-linux/openssl-native/1.0.2d-r0/openssl-1.0.2d/crypto&apos;
| /usr/bin/perl ../util/mkbuildinf.pl &quot;gcc  -I. -I.. -I../include  -fPIC -DOPENSSL_PIC -DOPENSSL_THREADS -D_REENTRANT -DDSO_DLFCN -DHAVE_DLFCN_H -DL_ENDIAN 	-DTERMIO -isystem/home/autobuilder/yocto-autobuilder/yocto-worker/nightly-oe-selftest/build/build/tmp/sysroots/x86_64-linux/usr/include -O2 -pipe -Wall -Wa,--noexecstack -DHAVE_CRYPTODEV -DUSE_CRYPTODEV_DIGESTS -DOPENSSL_IA32_SSE2 -DOPENSSL_BN_ASM_MONT -DOPENSSL_BN_ASM_MONT5 -DOPENSSL_BN_ASM_GF2m -DSHA1_ASM -DSHA256_ASM -DSHA512_ASM -DMD5_ASM -DAES_ASM -DVPAES_ASM -DBSAES_ASM -DWHIRLPOOL_ASM -DGHASH_ASM -DECP_NISTZ256_ASM&quot; &quot;linux-x86_64&quot; &gt;buildinf.h
| gcc  -I. -I.. -I../include  -fPIC -DOPENSSL_PIC -DOPENSSL_THREADS -D_REENTRANT -DDSO_DLFCN -DHAVE_DLFCN_H -DL_ENDIAN 	-DTERMIO -isystem/home/autobuilder/yocto-autobuilder/yocto-worker/nightly-oe-selftest/build/build/tmp/sysroots/x86_64-linux/usr/include -O2 -pipe -Wall -Wa,--noexecstack -DHAVE_CRYPTODEV -DUSE_CRYPTODEV_DIGESTS -DOPENSSL_IA32_SSE2 -DOPENSSL_BN_ASM_MONT -DOPENSSL_BN_ASM_MONT5 -DOPENSSL_BN_ASM_GF2m -DSHA1_ASM -DSHA256_ASM -DSHA512_ASM -DMD5_ASM -DAES_ASM -DVPAES_ASM -DBSAES_ASM -DWHIRLPOOL_ASM -DGHASH_ASM -DECP_NISTZ256_ASM -isystem/home/autobuilder/yocto-autobuilder/yocto-worker/nightly-oe-selftest/build/build/tmp/sysroots/x86_64-linux/usr/include  -c -o cryptlib.o cryptlib.c
| gcc  -I. -I.. -I../include  -fPIC -DOPENSSL_PIC -DOPENSSL_THREADS -D_REENTRANT -DDSO_DLFCN -DHAVE_DLFCN_H -DL_ENDIAN 	-DTERMIO -isystem/home/autobuilder/yocto-autobuilder/yocto-worker/nightly-oe-selftest/build/build/tmp/sysroots/x86_64-linux/usr/include -O2 -pipe -Wall -Wa,--noexecstack -DHAVE_CRYPTODEV -DUSE_CRYPTODEV_DIGESTS -DOPENSSL_IA32_SSE2 -DOPENSSL_BN_ASM_MONT -DOPENSSL_BN_ASM_MONT5 -DOPENSSL_BN_ASM_GF2m -DSHA1_ASM -DSHA256_ASM -DSHA512_ASM -DMD5_ASM -DAES_ASM -DVPAES_ASM -DBSAES_ASM -DWHIRLPOOL_ASM -DGHASH_ASM -DECP_NISTZ256_ASM -isystem/home/autobuilder/yocto-autobuilder/yocto-worker/nightly-oe-selftest/build/build/tmp/sysroots/x86_64-linux/usr/include  -c -o mem.o mem.c
| gcc  -I. -I.. -I../include  -fPIC -DOPENSSL_PIC -DOPENSSL_THREADS -D_REENTRANT -DDSO_DLFCN -DHAVE_DLFCN_H -DL_ENDIAN 	-DTERMIO -isystem/home/autobuilder/yocto-autobuilder/yocto-worker/nightly-oe-selftest/build/build/tmp/sysroots/x86_64-linux/usr/include -O2 -pipe -Wall -Wa,--noexecstack -DHAVE_CRYPTODEV -DUSE_CRYPTODEV_DIGESTS -DOPENSSL_IA32_SSE2 -DOPENSSL_BN_ASM_MONT -DOPENSSL_BN_ASM_MONT5 -DOPENSSL_BN_ASM_GF2m -DSHA1_ASM -DSHA256_ASM -DSHA512_ASM -DMD5_ASM -DAES_ASM -DVPAES_ASM -DBSAES_ASM -DWHIRLPOOL_ASM -DGHASH_ASM -DECP_NISTZ256_ASM -isystem/home/autobuilder/yocto-autobuilder/yocto-worker/nightly-oe-selftest/build/build/tmp/sysroots/x86_64-linux/usr/include  -c -o mem_dbg.o mem_dbg.c
| gcc  -I. -I.. -I../include  -fPIC -DOPENSSL_PIC -DOPENSSL_THREADS -D_REENTRANT -DDSO_DLFCN -DHAVE_DLFCN_H -DL_ENDIAN 	-DTERMIO -isystem/home/autobuilder/yocto-autobuilder/yocto-worker/nightly-oe-selftest/build/build/tmp/sysroots/x86_64-linux/usr/include -O2 -pipe -Wall -Wa,--noexecstack -DHAVE_CRYPTODEV -DUSE_CRYPTODEV_DIGESTS -DOPENSSL_IA32_SSE2 -DOPENSSL_BN_ASM_MONT -DOPENSSL_BN_ASM_MONT5 -DOPENSSL_BN_ASM_GF2m -DSHA1_ASM -DSHA256_ASM -DSHA512_ASM -DMD5_ASM -DAES_ASM -DVPAES_ASM -DBSAES_ASM -DWHIRLPOOL_ASM -DGHASH_ASM -DECP_NISTZ256_ASM -isystem/home/autobuilder/yocto-autobuilder/yocto-worker/nightly-oe-selftest/build/build/tmp/sysroots/x86_64-linux/usr/include  -c -o cversion.o cversion.c
| gcc  -I. -I.. -I../include  -fPIC -DOPENSSL_PIC -DOPENSSL_THREADS -D_REENTRANT -DDSO_DLFCN -DHAVE_DLFCN_H -DL_ENDIAN 	-DTERMIO -isystem/home/autobuilder/yocto-autobuilder/yocto-worker/nightly-oe-selftest/build/build/tmp/sysroots/x86_64-linux/usr/include -O2 -pipe -Wall -Wa,--noexecstack -DHAVE_CRYPTODEV -DUSE_CRYPTODEV_DIGESTS -DOPENSSL_IA32_SSE2 -DOPENSSL_BN_ASM_MONT -DOPENSSL_BN_ASM_MONT5 -DOPENSSL_BN_ASM_GF2m -DSHA1_ASM -DSHA256_ASM -DSHA512_ASM -DMD5_ASM -DAES_ASM -DVPAES_ASM -DBSAES_ASM -DWHIRLPOOL_ASM -DGHASH_ASM -DECP_NISTZ256_ASM -isystem/home/autobuilder/yocto-autobuilder/yocto-worker/nightly-oe-selftest/build/build/tmp/sysroots/x86_64-linux/usr/include  -c -o ex_data.o ex_data.c
| gcc  -I. -I.. -I../include  -fPIC -DOPENSSL_PIC -DOPENSSL_THREADS -D_REENTRANT -DDSO_DLFCN -DHAVE_DLFCN_H -DL_ENDIAN 	-DTERMIO -isystem/home/autobuilder/yocto-autobuilder/yocto-worker/nightly-oe-selftest/build/build/tmp/sysroots/x86_64-linux/usr/include -O2 -pipe -Wall -Wa,--noexecstack -DHAVE_CRYPTODEV -DUSE_CRYPTODEV_DIGESTS -DOPENSSL_IA32_SSE2 -DOPENSSL_BN_ASM_MONT -DOPENSSL_BN_ASM_MONT5 -DOPENSSL_BN_ASM_GF2m -DSHA1_ASM -DSHA256_ASM -DSHA512_ASM -DMD5_ASM -DAES_ASM -DVPAES_ASM -DBSAES_ASM -DWHIRLPOOL_ASM -DGHASH_ASM -DECP_NISTZ256_ASM -isystem/home/autobuilder/yocto-autobuilder/yocto-worker/nightly-oe-selftest/build/build/tmp/sysroots/x86_64-linux/usr/include  -c -o cpt_err.o cpt_err.c
| gcc  -I. -I.. -I../include  -fPIC -DOPENSSL_PIC -DOPENSSL_THREADS -D_REENTRANT -DDSO_DLFCN -DHAVE_DLFCN_H -DL_ENDIAN 	-DTERMIO -isystem/home/autobuilder/yocto-autobuilder/yocto-worker/nightly-oe-selftest/build/build/tmp/sysroots/x86_64-linux/usr/include -O2 -pipe -Wall -Wa,--noexecstack -DHAVE_CRYPTODEV -DUSE_CRYPTODEV_DIGESTS -DOPENSSL_IA32_SSE2 -DOPENSSL_BN_ASM_MONT -DOPENSSL_BN_ASM_MONT5 -DOPENSSL_BN_ASM_GF2m -DSHA1_ASM -DSHA256_ASM -DSHA512_ASM -DMD5_ASM -DAES_ASM -DVPAES_ASM -DBSAES_ASM -DWHIRLPOOL_ASM -DGHASH_ASM -DECP_NISTZ256_ASM -isystem/home/autobuilder/yocto-autobuilder/yocto-worker/nightly-oe-selftest/build/build/tmp/sysroots/x86_64-linux/usr/include  -c -o ebcdic.o ebcdic.c
| gcc  -I. -I.. -I../include  -fPIC -DOPENSSL_PIC -DOPENSSL_THREADS -D_REENTRANT -DDSO_DLFCN -DHAVE_DLFCN_H -DL_ENDIAN 	-DTERMIO -isystem/home/autobuilder/yocto-autobuilder/yocto-worker/nightly-oe-selftest/build/build/tmp/sysroots/x86_64-linux/usr/include -O2 -pipe -Wall -Wa,--noexecstack -DHAVE_CRYPTODEV -DUSE_CRYPTODEV_DIGESTS -DOPENSSL_IA32_SSE2 -DOPENSSL_BN_ASM_MONT -DOPENSSL_BN_ASM_MONT5 -DOPENSSL_BN_ASM_GF2m -DSHA1_ASM -DSHA256_ASM -DSHA512_ASM -DMD5_ASM -DAES_ASM -DVPAES_ASM -DBSAES_ASM -DWHIRLPOOL_ASM -DGHASH_ASM -DECP_NISTZ256_ASM -isystem/home/autobuilder/yocto-autobuilder/yocto-worker/nightly-oe-selftest/build/build/tmp/sysroots/x86_64-linux/usr/include  -c -o uid.o uid.c
| gcc  -I. -I.. -I../include  -fPIC -DOPENSSL_PIC -DOPENSSL_THREADS -D_REENTRANT -DDSO_DLFCN -DHAVE_DLFCN_H -DL_ENDIAN 	-DTERMIO -isystem/home/autobuilder/yocto-autobuilder/yocto-worker/nightly-oe-selftest/build/build/tmp/sysroots/x86_64-linux/usr/include -O2 -pipe -Wall -Wa,--noexecstack -DHAVE_CRYPTODEV -DUSE_CRYPTODEV_DIGESTS -DOPENSSL_IA32_SSE2 -DOPENSSL_BN_ASM_MONT -DOPENSSL_BN_ASM_MONT5 -DOPENSSL_BN_ASM_GF2m -DSHA1_ASM -DSHA256_ASM -DSHA512_ASM -DMD5_ASM -DAES_ASM -DVPAES_ASM -DBSAES_ASM -DWHIRLPOOL_ASM -DGHASH_ASM -DECP_NISTZ256_ASM -isystem/home/autobuilder/yocto-autobuilder/yocto-worker/nightly-oe-selftest/build/build/tmp/sysroots/x86_64-linux/usr/include  -c -o o_time.o o_time.c
| gcc  -I. -I.. -I../include  -fPIC -DOPENSSL_PIC -DOPENSSL_THREADS -D_REENTRANT -DDSO_DLFCN -DHAVE_DLFCN_H -DL_ENDIAN 	-DTERMIO -isystem/home/autobuilder/yocto-autobuilder/yocto-worker/nightly-oe-selftest/build/build/tmp/sysroots/x86_64-linux/usr/include -O2 -pipe -Wall -Wa,--noexecstack -DHAVE_CRYPTODEV -DUSE_CRYPTODEV_DIGESTS -DOPENSSL_IA32_SSE2 -DOPENSSL_BN_ASM_MONT -DOPENSSL_BN_ASM_MONT5 -DOPENSSL_BN_ASM_GF2m -DSHA1_ASM -DSHA256_ASM -DSHA512_ASM -DMD5_ASM -DAES_ASM -DVPAES_ASM -DBSAES_ASM -DWHIRLPOOL_ASM -DGHASH_ASM -DECP_NISTZ256_ASM -isystem/home/autobuilder/yocto-autobuilder/yocto-worker/nightly-oe-selftest/build/build/tmp/sysroots/x86_64-linux/usr/include  -c -o o_str.o o_str.c
| gcc  -I. -I.. -I../include  -fPIC -DOPENSSL_PIC -DOPENSSL_THREADS -D_REENTRANT -DDSO_DLFCN -DHAVE_DLFCN_H -DL_ENDIAN 	-DTERMIO -isystem/home/autobuilder/yocto-autobuilder/yocto-worker/nightly-oe-selftest/build/build/tmp/sysroots/x86_64-linux/usr/include -O2 -pipe -Wall -Wa,--noexecstack -DHAVE_CRYPTODEV -DUSE_CRYPTODEV_DIGESTS -DOPENSSL_IA32_SSE2 -DOPENSSL_BN_ASM_MONT -DOPENSSL_BN_ASM_MONT5 -DOPENSSL_BN_ASM_GF2m -DSHA1_ASM -DSHA256_ASM -DSHA512_ASM -DMD5_ASM -DAES_ASM -DVPAES_ASM -DBSAES_ASM -DWHIRLPOOL_ASM -DGHASH_ASM -DECP_NISTZ256_ASM -isystem/home/autobuilder/yocto-autobuilder/yocto-worker/nightly-oe-selftest/build/build/tmp/sysroots/x86_64-linux/usr/include  -c -o o_dir.o o_dir.c
| gcc  -I. -I.. -I../include  -fPIC -DOPENSSL_PIC -DOPENSSL_THREADS -D_REENTRANT -DDSO_DLFCN -DHAVE_DLFCN_H -DL_ENDIAN 	-DTERMIO -isystem/home/autobuilder/yocto-autobuilder/yocto-worker/nightly-oe-selftest/build/build/tmp/sysroots/x86_64-linux/usr/include -O2 -pipe -Wall -Wa,--noexecstack -DHAVE_CRYPTODEV -DUSE_CRYPTODEV_DIGESTS -DOPENSSL_IA32_SSE2 -DOPENSSL_BN_ASM_MONT -DOPENSSL_BN_ASM_MONT5 -DOPENSSL_BN_ASM_GF2m -DSHA1_ASM -DSHA256_ASM -DSHA512_ASM -DMD5_ASM -DAES_ASM -DVPAES_ASM -DBSAES_ASM -DWHIRLPOOL_ASM -DGHASH_ASM -DECP_NISTZ256_ASM -isystem/home/autobuilder/yocto-autobuilder/yocto-worker/nightly-oe-selftest/build/build/tmp/sysroots/x86_64-linux/usr/include  -c -o o_fips.o o_fips.c
| gcc  -I. -I.. -I../include  -fPIC -DOPENSSL_PIC -DOPENSSL_THREADS -D_REENTRANT -DDSO_DLFCN -DHAVE_DLFCN_H -DL_ENDIAN 	-DTERMIO -isystem/home/autobuilder/yocto-autobuilder/yocto-worker/nightly-oe-selftest/build/build/tmp/sysroots/x86_64-linux/usr/include -O2 -pipe -Wall -Wa,--noexecstack -DHAVE_CRYPTODEV -DUSE_CRYPTODEV_DIGESTS -DOPENSSL_IA32_SSE2 -DOPENSSL_BN_ASM_MONT -DOPENSSL_BN_ASM_MONT5 -DOPENSSL_BN_ASM_GF2m -DSHA1_ASM -DSHA256_ASM -DSHA512_ASM -DMD5_ASM -DAES_ASM -DVPAES_ASM -DBSAES_ASM -DWHIRLPOOL_ASM -DGHASH_ASM -DECP_NISTZ256_ASM -isystem/home/autobuilder/yocto-autobuilder/yocto-worker/nightly-oe-selftest/build/build/tmp/sysroots/x86_64-linux/usr/include  -c -o o_init.o o_init.c
| gcc  -I. -I.. -I../include  -fPIC -DOPENSSL_PIC -DOPENSSL_THREADS -D_REENTRANT -DDSO_DLFCN -DHAVE_DLFCN_H -DL_ENDIAN 	-DTERMIO -isystem/home/autobuilder/yocto-autobuilder/yocto-worker/nightly-oe-selftest/build/build/tmp/sysroots/x86_64-linux/usr/include -O2 -pipe -Wall -Wa,--noexecstack -DHAVE_CRYPTODEV -DUSE_CRYPTODEV_DIGESTS -DOPENSSL_IA32_SSE2 -DOPENSSL_BN_ASM_MONT -DOPENSSL_BN_ASM_MONT5 -DOPENSSL_BN_ASM_GF2m -DSHA1_ASM -DSHA256_ASM -DSHA512_ASM -DMD5_ASM -DAES_ASM -DVPAES_ASM -DBSAES_ASM -DWHIRLPOOL_ASM -DGHASH_ASM -DECP_NISTZ256_ASM -isystem/home/autobuilder/yocto-autobuilder/yocto-worker/nightly-oe-selftest/build/build/tmp/sysroots/x86_64-linux/usr/include  -c -o fips_ers.o fips_ers.c
| /usr/bin/perl x86_64cpuid.pl elf &gt; x86_64cpuid.s
| Can&apos;t locate bigint.pm in @INC (you may need to install the bigint module) (@INC contains: /usr/local/lib64/perl5 /usr/local/share/perl5 /usr/lib64/perl5/vendor_perl /usr/share/perl5/vendor_perl /usr/lib64/perl5 /usr/share/perl5 .) at perlasm/x86_64-xlate.pl line 200.
| BEGIN failed--compilation aborted at perlasm/x86_64-xlate.pl line 200.
| gcc  -I. -I.. -I../include  -fPIC -DOPENSSL_PIC -DOPENSSL_THREADS -D_REENTRANT -DDSO_DLFCN -DHAVE_DLFCN_H -DL_ENDIAN 	-DTERMIO -isystem/home/autobuilder/yocto-autobuilder/yocto-worker/nightly-oe-selftest/build/build/tmp/sysroots/x86_64-linux/usr/include -O2 -pipe -Wall -Wa,--noexecstack -DHAVE_CRYPTODEV -DUSE_CRYPTODEV_DIGESTS -DOPENSSL_IA32_SSE2 -DOPENSSL_BN_ASM_MONT -DOPENSSL_BN_ASM_MONT5 -DOPENSSL_BN_ASM_GF2m -DSHA1_ASM -DSHA256_ASM -DSHA512_ASM -DMD5_ASM -DAES_ASM -DVPAES_ASM -DBSAES_ASM -DWHIRLPOOL_ASM -DGHASH_ASM -DECP_NISTZ256_ASM -c  -o x86_64cpuid.o x86_64cpuid.s
| ar r ../libcrypto.a cryptlib.o mem.o mem_dbg.o cversion.o ex_data.o cpt_err.o ebcdic.o uid.o o_time.o o_str.o o_dir.o o_fips.o o_init.o fips_ers.o x86_64cpuid.o
| ar: creating ../libcrypto.a
| test -z &quot;&quot; || ar r ../libcrypto.a fipscanister.o
| ranlib ../libcrypto.a || echo Never mind.
| making all in crypto/objects...
| make[2]: Entering directory &apos;/home/autobuilder/yocto-autobuilder/yocto-worker/nightly-oe-selftest/build/build/tmp/work/x86_64-linux/openssl-native/1.0.2d-r0/openssl-1.0.2d/crypto/objects&apos;
| gcc  -I.. -I../.. -I../modes -I../asn1 -I../evp -I../../include  -fPIC -DOPENSSL_PIC -DOPENSSL_THREADS -D_REENTRANT -DDSO_DLFCN -DHAVE_DLFCN_H -DL_ENDIAN 	-DTERMIO -isystem/home/autobuilder/yocto-autobuilder/yocto-worker/nightly-oe-selftest/build/build/tmp/sysroots/x86_64-linux/usr/include -O2 -pipe -Wall -Wa,--noexecstack -DHAVE_CRYPTODEV -DUSE_CRYPTODEV_DIGESTS -DOPENSSL_IA32_SSE2 -DOPENSSL_BN_ASM_MONT -DOPENSSL_BN_ASM_MONT5 -DOPENSSL_BN_ASM_GF2m -DSHA1_ASM -DSHA256_ASM -DSHA512_ASM -DMD5_ASM -DAES_ASM -DVPAES_ASM -DBSAES_ASM -DWHIRLPOOL_ASM -DGHASH_ASM -DECP_NISTZ256_ASM -isystem/home/autobuilder/yocto-autobuilder/yocto-worker/nightly-oe-selftest/build/build/tmp/sysroots/x86_64-linux/usr/include  -c -o o_names.o o_names.c
| gcc  -I.. -I../.. -I../modes -I../asn1 -I../evp -I../../include  -fPIC -DOPENSSL_PIC -DOPENSSL_THREADS -D_REENTRANT -DDSO_DLFCN -DHAVE_DLFCN_H -DL_ENDIAN 	-DTERMIO -isystem/home/autobuilder/yocto-autobuilder/yocto-worker/nightly-oe-selftest/build/build/tmp/sysroots/x86_64-linux/usr/include -O2 -pipe -Wall -Wa,--noexecstack -DHAVE_CRYPTODEV -DUSE_CRYPTODEV_DIGESTS -DOPENSSL_IA32_SSE2 -DOPENSSL_BN_ASM_MONT -DOPENSSL_BN_ASM_MONT5 -DOPENSSL_BN_ASM_GF2m -DSHA1_ASM -DSHA256_ASM -DSHA512_ASM -DMD5_ASM -DAES_ASM -DVPAES_ASM -DBSAES_ASM -DWHIRLPOOL_ASM -DGHASH_ASM -DECP_NISTZ256_ASM -isystem/home/autobuilder/yocto-autobuilder/yocto-worker/nightly-oe-selftest/build/build/tmp/sysroots/x86_64-linux/usr/include  -c -o obj_dat.o obj_dat.c
| gcc  -I.. -I../.. -I../modes -I../asn1 -I../evp -I../../include  -fPIC -DOPENSSL_PIC -DOPENSSL_THREADS -D_REENTRANT -DDSO_DLFCN -DHAVE_DLFCN_H -DL_ENDIAN 	-DTERMIO -isystem/home/autobuilder/yocto-autobuilder/yocto-worker/nightly-oe-selftest/build/build/tmp/sysroots/x86_64-linux/usr/include -O2 -pipe -Wall -Wa,--noexecstack -DHAVE_CRYPTODEV -DUSE_CRYPTODEV_DIGESTS -DOPENSSL_IA32_SSE2 -DOPENSSL_BN_ASM_MONT -DOPENSSL_BN_ASM_MONT5 -DOPENSSL_BN_ASM_GF2m -DSHA1_ASM -DSHA256_ASM -DSHA512_ASM -DMD5_ASM -DAES_ASM -DVPAES_ASM -DBSAES_ASM -DWHIRLPOOL_ASM -DGHASH_ASM -DECP_NISTZ256_ASM -isystem/home/autobuilder/yocto-autobuilder/yocto-worker/nightly-oe-selftest/build/build/tmp/sysroots/x86_64-linux/usr/include  -c -o obj_lib.o obj_lib.c
| gcc  -I.. -I../.. -I../modes -I../asn1 -I../evp -I../../include  -fPIC -DOPENSSL_PIC -DOPENSSL_THREADS -D_REENTRANT -DDSO_DLFCN -DHAVE_DLFCN_H -DL_ENDIAN 	-DTERMIO -isystem/home/autobuilder/yocto-autobuilder/yocto-worker/nightly-oe-selftest/build/build/tmp/sysroots/x86_64-linux/usr/include -O2 -pipe -Wall -Wa,--noexecstack -DHAVE_CRYPTODEV -DUSE_CRYPTODEV_DIGESTS -DOPENSSL_IA32_SSE2 -DOPENSSL_BN_ASM_MONT -DOPENSSL_BN_ASM_MONT5 -DOPENSSL_BN_ASM_GF2m -DSHA1_ASM -DSHA256_ASM -DSHA512_ASM -DMD5_ASM -DAES_ASM -DVPAES_ASM -DBSAES_ASM -DWHIRLPOOL_ASM -DGHASH_ASM -DECP_NISTZ256_ASM -isystem/home/autobuilder/yocto-autobuilder/yocto-worker/nightly-oe-selftest/build/build/tmp/sysroots/x86_64-linux/usr/include  -c -o obj_err.o obj_err.c
| gcc  -I.. -I../.. -I../modes -I../asn1 -I../evp -I../../include  -fPIC -DOPENSSL_PIC -DOPENSSL_THREADS -D_REENTRANT -DDSO_DLFCN -DHAVE_DLFCN_H -DL_ENDIAN 	-DTERMIO -isystem/home/autobuilder/yocto-autobuilder/yocto-worker/nightly-oe-selftest/build/build/tmp/sysroots/x86_64-linux/usr/include -O2 -pipe -Wall -Wa,--noexecstack -DHAVE_CRYPTODEV -DUSE_CRYPTODEV_DIGESTS -DOPENSSL_IA32_SSE2 -DOPENSSL_BN_ASM_MONT -DOPENSSL_BN_ASM_MONT5 -DOPENSSL_BN_ASM_GF2m -DSHA1_ASM -DSHA256_ASM -DSHA512_ASM -DMD5_ASM -DAES_ASM -DVPAES_ASM -DBSAES_ASM -DWHIRLPOOL_ASM -DGHASH_ASM -DECP_NISTZ256_ASM -isystem/home/autobuilder/yocto-autobuilder/yocto-worker/nightly-oe-selftest/build/build/tmp/sysroots/x86_64-linux/usr/include  -c -o obj_xref.o obj_xref.c
| ar r ../../libcrypto.a o_names.o obj_dat.o obj_lib.o obj_err.o obj_xref.o
| ranlib ../../libcrypto.a || echo Never mind.
| make[2]: Leaving directory &apos;/home/autobuilder/yocto-autobuilder/yocto-worker/nightly-oe-selftest/build/build/tmp/work/x86_64-linux/openssl-native/1.0.2d-r0/openssl-1.0.2d/crypto/objects&apos;
| making all in crypto/md4...
| make[2]: Entering directory &apos;/home/autobuilder/yocto-autobuilder/yocto-worker/nightly-oe-selftest/build/build/tmp/work/x86_64-linux/openssl-native/1.0.2d-r0/openssl-1.0.2d/crypto/md4&apos;
| gcc  -I.. -I../.. -I../modes -I../asn1 -I../evp -I../../include  -fPIC -DOPENSSL_PIC -DOPENSSL_THREADS -D_REENTRANT -DDSO_DLFCN -DHAVE_DLFCN_H -DL_ENDIAN 	-DTERMIO -isystem/home/autobuilder/yocto-autobuilder/yocto-worker/nightly-oe-selftest/build/build/tmp/sysroots/x86_64-linux/usr/include -O2 -pipe -Wall -Wa,--noexecstack -DHAVE_CRYPTODEV -DUSE_CRYPTODEV_DIGESTS -DOPENSSL_IA32_SSE2 -DOPENSSL_BN_ASM_MONT -DOPENSSL_BN_ASM_MONT5 -DOPENSSL_BN_ASM_GF2m -DSHA1_ASM -DSHA256_ASM -DSHA512_ASM -DMD5_ASM -DAES_ASM -DVPAES_ASM -DBSAES_ASM -DWHIRLPOOL_ASM -DGHASH_ASM -DECP_NISTZ256_ASM -isystem/home/autobuilder/yocto-autobuilder/yocto-worker/nightly-oe-selftest/build/build/tmp/sysroots/x86_64-linux/usr/include  -c -o md4_dgst.o md4_dgst.c
| gcc  -I.. -I../.. -I../modes -I../asn1 -I../evp -I../../include  -fPIC -DOPENSSL_PIC -DOPENSSL_THREADS -D_REENTRANT -DDSO_DLFCN -DHAVE_DLFCN_H -DL_ENDIAN 	-DTERMIO -isystem/home/autobuilder/yocto-autobuilder/yocto-worker/nightly-oe-selftest/build/build/tmp/sysroots/x86_64-linux/usr/include -O2 -pipe -Wall -Wa,--noexecstack -DHAVE_CRYPTODEV -DUSE_CRYPTODEV_DIGESTS -DOPENSSL_IA32_SSE2 -DOPENSSL_BN_ASM_MONT -DOPENSSL_BN_ASM_MONT5 -DOPENSSL_BN_ASM_GF2m -DSHA1_ASM -DSHA256_ASM -DSHA512_ASM -DMD5_ASM -DAES_ASM -DVPAES_ASM -DBSAES_ASM -DWHIRLPOOL_ASM -DGHASH_ASM -DECP_NISTZ256_ASM -isystem/home/autobuilder/yocto-autobuilder/yocto-worker/nightly-oe-selftest/build/build/tmp/sysroots/x86_64-linux/usr/include  -c -o md4_one.o md4_one.c
| ar r ../../libcrypto.a md4_dgst.o md4_one.o
| ranlib ../../libcrypto.a || echo Never mind.
| make[2]: Leaving directory &apos;/home/autobuilder/yocto-autobuilder/yocto-worker/nightly-oe-selftest/build/build/tmp/work/x86_64-linux/openssl-native/1.0.2d-r0/openssl-1.0.2d/crypto/md4&apos;
| making all in crypto/md5...
| make[2]: Entering directory &apos;/home/autobuilder/yocto-autobuilder/yocto-worker/nightly-oe-selftest/build/build/tmp/work/x86_64-linux/openssl-native/1.0.2d-r0/openssl-1.0.2d/crypto/md5&apos;
| gcc  -I.. -I../.. -I../modes -I../asn1 -I../evp -I../../include  -fPIC -DOPENSSL_PIC -DOPENSSL_THREADS -D_REENTRANT -DDSO_DLFCN -DHAVE_DLFCN_H -DL_ENDIAN 	-DTERMIO -isystem/home/autobuilder/yocto-autobuilder/yocto-worker/nightly-oe-selftest/build/build/tmp/sysroots/x86_64-linux/usr/include -O2 -pipe -Wall -Wa,--noexecstack -DHAVE_CRYPTODEV -DUSE_CRYPTODEV_DIGESTS -DOPENSSL_IA32_SSE2 -DOPENSSL_BN_ASM_MONT -DOPENSSL_BN_ASM_MONT5 -DOPENSSL_BN_ASM_GF2m -DSHA1_ASM -DSHA256_ASM -DSHA512_ASM -DMD5_ASM -DAES_ASM -DVPAES_ASM -DBSAES_ASM -DWHIRLPOOL_ASM -DGHASH_ASM -DECP_NISTZ256_ASM -isystem/home/autobuilder/yocto-autobuilder/yocto-worker/nightly-oe-selftest/build/build/tmp/sysroots/x86_64-linux/usr/include  -c -o md5_dgst.o md5_dgst.c
| gcc  -I.. -I../.. -I../modes -I../asn1 -I../evp -I../../include  -fPIC -DOPENSSL_PIC -DOPENSSL_THREADS -D_REENTRANT -DDSO_DLFCN -DHAVE_DLFCN_H -DL_ENDIAN 	-DTERMIO -isystem/home/autobuilder/yocto-autobuilder/yocto-worker/nightly-oe-selftest/build/build/tmp/sysroots/x86_64-linux/usr/include -O2 -pipe -Wall -Wa,--noexecstack -DHAVE_CRYPTODEV -DUSE_CRYPTODEV_DIGESTS -DOPENSSL_IA32_SSE2 -DOPENSSL_BN_ASM_MONT -DOPENSSL_BN_ASM_MONT5 -DOPENSSL_BN_ASM_GF2m -DSHA1_ASM -DSHA256_ASM -DSHA512_ASM -DMD5_ASM -DAES_ASM -DVPAES_ASM -DBSAES_ASM -DWHIRLPOOL_ASM -DGHASH_ASM -DECP_NISTZ256_ASM -isystem/home/autobuilder/yocto-autobuilder/yocto-worker/nightly-oe-selftest/build/build/tmp/sysroots/x86_64-linux/usr/include  -c -o md5_one.o md5_one.c
| /usr/bin/perl asm/md5-x86_64.pl elf &gt; md5-x86_64.s
| Can&apos;t locate bigint.pm in @INC (you may need to install the bigint module) (@INC contains: /usr/local/lib64/perl5 /usr/local/share/perl5 /usr/lib64/perl5/vendor_perl /usr/share/perl5/vendor_perl /usr/lib64/perl5 /usr/share/perl5 .) at asm/../../perlasm/x86_64-xlate.pl line 200.
| BEGIN failed--compilation aborted at asm/../../perlasm/x86_64-xlate.pl line 200.
| gcc  -I.. -I../.. -I../modes -I../asn1 -I../evp -I../../include  -fPIC -DOPENSSL_PIC -DOPENSSL_THREADS -D_REENTRANT -DDSO_DLFCN -DHAVE_DLFCN_H -DL_ENDIAN 	-DTERMIO -isystem/home/autobuilder/yocto-autobuilder/yocto-worker/nightly-oe-selftest/build/build/tmp/sysroots/x86_64-linux/usr/include -O2 -pipe -Wall -Wa,--noexecstack -DHAVE_CRYPTODEV -DUSE_CRYPTODEV_DIGESTS -DOPENSSL_IA32_SSE2 -DOPENSSL_BN_ASM_MONT -DOPENSSL_BN_ASM_MONT5 -DOPENSSL_BN_ASM_GF2m -DSHA1_ASM -DSHA256_ASM -DSHA512_ASM -DMD5_ASM -DAES_ASM -DVPAES_ASM -DBSAES_ASM -DWHIRLPOOL_ASM -DGHASH_ASM -DECP_NISTZ256_ASM -c  -o md5-x86_64.o md5-x86_64.s
| ar r ../../libcrypto.a md5_dgst.o md5_one.o md5-x86_64.o
| ranlib ../../libcrypto.a || echo Never mind.
| make[2]: Leaving directory &apos;/home/autobuilder/yocto-autobuilder/yocto-worker/nightly-oe-selftest/build/build/tmp/work/x86_64-linux/openssl-native/1.0.2d-r0/openssl-1.0.2d/crypto/md5&apos;
| making all in crypto/sha...
| make[2]: Entering directory &apos;/home/autobuilder/yocto-autobuilder/yocto-worker/nightly-oe-selftest/build/build/tmp/work/x86_64-linux/openssl-native/1.0.2d-r0/openssl-1.0.2d/crypto/sha&apos;
| gcc  -I.. -I../.. -I../modes -I../asn1 -I../evp -I../../include  -fPIC -DOPENSSL_PIC -DOPENSSL_THREADS -D_REENTRANT -DDSO_DLFCN -DHAVE_DLFCN_H -DL_ENDIAN 	-DTERMIO -isystem/home/autobuilder/yocto-autobuilder/yocto-worker/nightly-oe-selftest/build/build/tmp/sysroots/x86_64-linux/usr/include -O2 -pipe -Wall -Wa,--noexecstack -DHAVE_CRYPTODEV -DUSE_CRYPTODEV_DIGESTS -DOPENSSL_IA32_SSE2 -DOPENSSL_BN_ASM_MONT -DOPENSSL_BN_ASM_MONT5 -DOPENSSL_BN_ASM_GF2m -DSHA1_ASM -DSHA256_ASM -DSHA512_ASM -DMD5_ASM -DAES_ASM -DVPAES_ASM -DBSAES_ASM -DWHIRLPOOL_ASM -DGHASH_ASM -DECP_NISTZ256_ASM -isystem/home/autobuilder/yocto-autobuilder/yocto-worker/nightly-oe-selftest/build/build/tmp/sysroots/x86_64-linux/usr/include  -c -o sha_dgst.o sha_dgst.c
| gcc  -I.. -I../.. -I../modes -I../asn1 -I../evp -I../../include  -fPIC -DOPENSSL_PIC -DOPENSSL_THREADS -D_REENTRANT -DDSO_DLFCN -DHAVE_DLFCN_H -DL_ENDIAN 	-DTERMIO -isystem/home/autobuilder/yocto-autobuilder/yocto-worker/nightly-oe-selftest/build/build/tmp/sysroots/x86_64-linux/usr/include -O2 -pipe -Wall -Wa,--noexecstack -DHAVE_CRYPTODEV -DUSE_CRYPTODEV_DIGESTS -DOPENSSL_IA32_SSE2 -DOPENSSL_BN_ASM_MONT -DOPENSSL_BN_ASM_MONT5 -DOPENSSL_BN_ASM_GF2m -DSHA1_ASM -DSHA256_ASM -DSHA512_ASM -DMD5_ASM -DAES_ASM -DVPAES_ASM -DBSAES_ASM -DWHIRLPOOL_ASM -DGHASH_ASM -DECP_NISTZ256_ASM -isystem/home/autobuilder/yocto-autobuilder/yocto-worker/nightly-oe-selftest/build/build/tmp/sysroots/x86_64-linux/usr/include  -c -o sha1dgst.o sha1dgst.c
| gcc  -I.. -I../.. -I../modes -I../asn1 -I../evp -I../../include  -fPIC -DOPENSSL_PIC -DOPENSSL_THREADS -D_REENTRANT -DDSO_DLFCN -DHAVE_DLFCN_H -DL_ENDIAN 	-DTERMIO -isystem/home/autobuilder/yocto-autobuilder/yocto-worker/nightly-oe-selftest/build/build/tmp/sysroots/x86_64-linux/usr/include -O2 -pipe -Wall -Wa,--noexecstack -DHAVE_CRYPTODEV -DUSE_CRYPTODEV_DIGESTS -DOPENSSL_IA32_SSE2 -DOPENSSL_BN_ASM_MONT -DOPENSSL_BN_ASM_MONT5 -DOPENSSL_BN_ASM_GF2m -DSHA1_ASM -DSHA256_ASM -DSHA512_ASM -DMD5_ASM -DAES_ASM -DVPAES_ASM -DBSAES_ASM -DWHIRLPOOL_ASM -DGHASH_ASM -DECP_NISTZ256_ASM -isystem/home/autobuilder/yocto-autobuilder/yocto-worker/nightly-oe-selftest/build/build/tmp/sysroots/x86_64-linux/usr/include  -c -o sha_one.o sha_one.c
| gcc  -I.. -I../.. -I../modes -I../asn1 -I../evp -I../../include  -fPIC -DOPENSSL_PIC -DOPENSSL_THREADS -D_REENTRANT -DDSO_DLFCN -DHAVE_DLFCN_H -DL_ENDIAN 	-DTERMIO -isystem/home/autobuilder/yocto-autobuilder/yocto-worker/nightly-oe-selftest/build/build/tmp/sysroots/x86_64-linux/usr/include -O2 -pipe -Wall -Wa,--noexecstack -DHAVE_CRYPTODEV -DUSE_CRYPTODEV_DIGESTS -DOPENSSL_IA32_SSE2 -DOPENSSL_BN_ASM_MONT -DOPENSSL_BN_ASM_MONT5 -DOPENSSL_BN_ASM_GF2m -DSHA1_ASM -DSHA256_ASM -DSHA512_ASM -DMD5_ASM -DAES_ASM -DVPAES_ASM -DBSAES_ASM -DWHIRLPOOL_ASM -DGHASH_ASM -DECP_NISTZ256_ASM -isystem/home/autobuilder/yocto-autobuilder/yocto-worker/nightly-oe-selftest/build/build/tmp/sysroots/x86_64-linux/usr/include  -c -o sha1_one.o sha1_one.c
| gcc  -I.. -I../.. -I../modes -I../asn1 -I../evp -I../../include  -fPIC -DOPENSSL_PIC -DOPENSSL_THREADS -D_REENTRANT -DDSO_DLFCN -DHAVE_DLFCN_H -DL_ENDIAN 	-DTERMIO -isystem/home/autobuilder/yocto-autobuilder/yocto-worker/nightly-oe-selftest/build/build/tmp/sysroots/x86_64-linux/usr/include -O2 -pipe -Wall -Wa,--noexecstack -DHAVE_CRYPTODEV -DUSE_CRYPTODEV_DIGESTS -DOPENSSL_IA32_SSE2 -DOPENSSL_BN_ASM_MONT -DOPENSSL_BN_ASM_MONT5 -DOPENSSL_BN_ASM_GF2m -DSHA1_ASM -DSHA256_ASM -DSHA512_ASM -DMD5_ASM -DAES_ASM -DVPAES_ASM -DBSAES_ASM -DWHIRLPOOL_ASM -DGHASH_ASM -DECP_NISTZ256_ASM -isystem/home/autobuilder/yocto-autobuilder/yocto-worker/nightly-oe-selftest/build/build/tmp/sysroots/x86_64-linux/usr/include  -c -o sha256.o sha256.c
| gcc  -I.. -I../.. -I../modes -I../asn1 -I../evp -I../../include  -fPIC -DOPENSSL_PIC -DOPENSSL_THREADS -D_REENTRANT -DDSO_DLFCN -DHAVE_DLFCN_H -DL_ENDIAN 	-DTERMIO -isystem/home/autobuilder/yocto-autobuilder/yocto-worker/nightly-oe-selftest/build/build/tmp/sysroots/x86_64-linux/usr/include -O2 -pipe -Wall -Wa,--noexecstack -DHAVE_CRYPTODEV -DUSE_CRYPTODEV_DIGESTS -DOPENSSL_IA32_SSE2 -DOPENSSL_BN_ASM_MONT -DOPENSSL_BN_ASM_MONT5 -DOPENSSL_BN_ASM_GF2m -DSHA1_ASM -DSHA256_ASM -DSHA512_ASM -DMD5_ASM -DAES_ASM -DVPAES_ASM -DBSAES_ASM -DWHIRLPOOL_ASM -DGHASH_ASM -DECP_NISTZ256_ASM -isystem/home/autobuilder/yocto-autobuilder/yocto-worker/nightly-oe-selftest/build/build/tmp/sysroots/x86_64-linux/usr/include  -c -o sha512.o sha512.c
| /usr/bin/perl asm/sha1-x86_64.pl elf &gt; sha1-x86_64.s
| Can&apos;t locate bigint.pm in @INC (you may need to install the bigint module) (@INC contains: /usr/local/lib64/perl5 /usr/local/share/perl5 /usr/lib64/perl5/vendor_perl /usr/share/perl5/vendor_perl /usr/lib64/perl5 /usr/share/perl5 .) at asm/../../perlasm/x86_64-xlate.pl line 200.
| BEGIN failed--compilation aborted at asm/../../perlasm/x86_64-xlate.pl line 200.
| Makefile:68: recipe for target &apos;sha1-x86_64.s&apos; failed
| make[2]: *** [sha1-x86_64.s] Error 141
| make[2]: Leaving directory &apos;/home/autobuilder/yocto-autobuilder/yocto-worker/nightly-oe-selftest/build/build/tmp/work/x86_64-linux/openssl-native/1.0.2d-r0/openssl-1.0.2d/crypto/sha&apos;
| Makefile:88: recipe for target &apos;subdirs&apos; failed
| make[1]: *** [subdirs] Error 1
| make[1]: Leaving directory &apos;/home/autobuilder/yocto-autobuilder/yocto-worker/nightly-oe-selftest/build/build/tmp/work/x86_64-linux/openssl-native/1.0.2d-r0/openssl-1.0.2d/crypto&apos;
| Makefile:284: recipe for target &apos;build_crypto&apos; failed
| make: *** [build_crypto] Error 1
| WARNING: /home/autobuilder/yocto-autobuilder/yocto-worker/nightly-oe-selftest/build/build/tmp/work/x86_64-linux/openssl-native/1.0.2d-r0/temp/run.do_compile.21956:1 exit 1 from
|   exit 1
| ERROR: oe_runmake failed
| ERROR: Function failed: do_compile (log file is located at /home/autobuilder/yocto-autobuilder/yocto-worker/nightly-oe-selftest/build/build/tmp/work/x86_64-linux/openssl-native/1.0.2d-r0/temp/log.do_compile.21956)
NOTE: recipe openssl-native-1.0.2d-r0: task do_compile: Failed</thetext>
  </long_desc><long_desc isprivate="0" >
    <commentid>55790</commentid>
    <comment_count>1</comment_count>
    <who name="Armin Kuster">akuster</who>
    <bug_when>2015-10-26 22:51:50 +0000</bug_when>
    <thetext>
http://cgit.openembedded.org/openembedded-core/commit/?id=8230f873921d5c16106e3ebf57053a646bc6ad78

introduced using &quot;bigint&quot;, wonder if we need to build some supporting perl packages?</thetext>
  </long_desc><long_desc isprivate="0" >
    <commentid>55858</commentid>
    <comment_count>2</comment_count>
    <who name="Ross Burton">ross.burton</who>
    <bug_when>2015-10-27 17:38:53 +0000</bug_when>
    <thetext>Mihail, can you try installing perl-Math-BigInt on the fedora 23 machine?</thetext>
  </long_desc><long_desc isprivate="0" >
    <commentid>55859</commentid>
    <comment_count>3</comment_count>
    <who name="Ross Burton">ross.burton</who>
    <bug_when>2015-10-27 17:47:26 +0000</bug_when>
    <thetext>My mistake, perl-bignum.</thetext>
  </long_desc><long_desc isprivate="0" >
    <commentid>55861</commentid>
    <comment_count>4</comment_count>
    <who name="Ross Burton">ross.burton</who>
    <bug_when>2015-10-27 17:52:18 +0000</bug_when>
    <thetext>I *think* that replacing &quot;use bigint&quot; with &quot;use Math::BigInt &apos;:constant&apos;&quot; will have the same effect but work out of the box on F23 without requiring perl-bignum to be installed (it isn&apos;t by default).  Armin, I literally know no perl, can you verify this?</thetext>
  </long_desc><long_desc isprivate="0" >
    <commentid>55867</commentid>
    <comment_count>5</comment_count>
    <who name="Armin Kuster">akuster</who>
    <bug_when>2015-10-28 00:53:48 +0000</bug_when>
    <thetext>Ross,

I don&apos;t know perl either. I will d/l F23 and give is shot.</thetext>
  </long_desc><long_desc isprivate="0" >
    <commentid>55946</commentid>
    <comment_count>6</comment_count>
    <who name="Mihail Stanciu">stanciux.mihail</who>
    <bug_when>2015-10-28 16:26:27 +0000</bug_when>
    <thetext>(In reply to comment #3)
&gt; My mistake, perl-bignum.

This was already installed.
Also had installed before perl-Math-BigInt-GMP perl-Math-BigInt-FastCalc and perl-Math-BigInt, just in case.

Neither of these did the trick.</thetext>
  </long_desc><long_desc isprivate="0" >
    <commentid>56295</commentid>
    <comment_count>7</comment_count>
    <who name="Ross Burton">ross.burton</who>
    <bug_when>2015-11-06 15:14:48 +0000</bug_when>
    <thetext>A friend who uses F23 hit this and reports that installing perl-bignum fixed the problem.</thetext>
  </long_desc><long_desc isprivate="0" >
    <commentid>56315</commentid>
    <comment_count>8</comment_count>
    <who name="Ross Burton">ross.burton</who>
    <bug_when>2015-11-09 12:16:38 +0000</bug_when>
    <thetext>Mihail, after installing perl-bignum and rebuilding perl did it fail in exactly the same way, or differently?  I&apos;ve had reports that openssl-native still fails to link correctly after installing perl-bignum but the failure is unrelated to this.</thetext>
  </long_desc><long_desc isprivate="0" >
    <commentid>56381</commentid>
    <comment_count>9</comment_count>
    <who name="Mihail Stanciu">stanciux.mihail</who>
    <bug_when>2015-11-11 13:23:53 +0000</bug_when>
    <thetext>Just finished testing on a fresh fedora23 machine.

Perl-bignum does indeed fix this build error, once I cleared the cache of openssl-native; as mentioned by Ross above, it was still linking incorectly.</thetext>
  </long_desc><long_desc isprivate="0" >
    <commentid>56383</commentid>
    <comment_count>10</comment_count>
    <who name="Ross Burton">ross.burton</who>
    <bug_when>2015-11-11 15:03:19 +0000</bug_when>
    <thetext>Patch on the list to add a sanity check when building openssl.</thetext>
  </long_desc><long_desc isprivate="0" >
    <commentid>56828</commentid>
    <comment_count>11</comment_count>
    <who name="">samset</who>
    <bug_when>2015-11-26 21:49:20 +0000</bug_when>
    <thetext>Hi,

What&apos;s the workaround to clear the link failure ?

Thank you.



make[4]: Entering directory &apos;/production/factory/poky/build/tmp/work/x86_64-linux/openssl-native/1.0.2d-r0/openssl-1.0.2d&apos;
| /usr/bin/ld: libcrypto.a(sha256-x86_64.o): relocation R_X86_64_PC32 against undefined symbol `OPENSSL_ia32cap_P&apos; can not be used when making a shared object; recompile with -fPIC
| /usr/bin/ld: final link failed: Bad value
| collect2: error: ld returned 1 exit status
| Makefile.shared:169: recipe for target &apos;link_a.gnu&apos; failed</thetext>
  </long_desc><long_desc isprivate="0" >
    <commentid>57595</commentid>
    <comment_count>12</comment_count>
    <who name="Ross Burton">ross.burton</who>
    <bug_when>2016-01-06 18:51:24 +0000</bug_when>
    <thetext>The bignum warning is merged as of 2f9a2fbc46aa435a0a7f7662bb62029ac714f25a.

samset: can you still replicate the link failure?  Is that with master or jethro?</thetext>
  </long_desc><long_desc isprivate="0" >
    <commentid>58058</commentid>
    <comment_count>13</comment_count>
    <who name="Ross Burton">ross.burton</who>
    <bug_when>2016-01-21 12:54:49 +0000</bug_when>
    <thetext>Closing, no further reports of openssl-native failing on F23.</thetext>
  </long_desc><long_desc isprivate="0" >
    <commentid>58739</commentid>
    <comment_count>14</comment_count>
    <who name="Bogdan Alexandru Voiculescu">bogdanx.a.voiculescu</who>
    <bug_when>2016-02-08 16:10:01 +0000</bug_when>
    <thetext>Verified on 3d2c0f5902cacf9d8544bf263b51ef0dd1a7218c</thetext>
  </long_desc>
      
      

    </bug>

</bugzilla>