<?xml version="1.0" encoding="UTF-8" standalone="yes" ?>
<!DOCTYPE bugzilla SYSTEM "https://bugzilla.yoctoproject.org/page.cgi?id=bugzilla.dtd">

<bugzilla version="5.0.6"
          urlbase="https://bugzilla.yoctoproject.org/"
          
          maintainer="it-coreprojects-helpdesk@linuxfoundation.org"
>

    <bug>
          <bug_id>9316</bug_id>
          
          <creation_ts>2016-03-21 12:20:53 +0000</creation_ts>
          <short_desc>bitbake-selftest fails in nightly with master on the autobuilder</short_desc>
          <delta_ts>2016-03-21 12:56:58 +0000</delta_ts>
          <reporter_accessible>1</reporter_accessible>
          <cclist_accessible>1</cclist_accessible>
          <classification_id>7</classification_id>
          <classification>Build System, Metadata &amp; Runtime</classification>
          <product>BitBake</product>
          <component>bitbake</component>
          <version>2.1</version>
          <rep_platform>x86</rep_platform>
          <op_sys>Multiple</op_sys>
          <bug_status>RESOLVED</bug_status>
          <resolution>FIXED</resolution>
          
          
          <bug_file_loc></bug_file_loc>
          <status_whiteboard></status_whiteboard>
          <keywords></keywords>
          <priority>Undecided</priority>
          <bug_severity>normal</bug_severity>
          <target_milestone>---</target_milestone>
          
          
          <everconfirmed>1</everconfirmed>
          <reporter name="Joshua Lock">joshuagloe</reporter>
          <assigned_to name="Richard Purdie">richard.purdie</assigned_to>
          <cc>poky.bs.watcher</cc>
    
    <cc>poky.watcher</cc>
          
          
          <cf_os>---</cf_os>
          <cf_regression_type>---</cf_regression_type>
          
          <cf_docchange>No (bug/feature does not impact docs)</cf_docchange>

      

      

      

          <comment_sort_order>oldest_to_newest</comment_sort_order>  
          <long_desc isprivate="0" >
    <commentid>60199</commentid>
    <comment_count>0</comment_count>
    <who name="Joshua Lock">joshuagloe</who>
    <bug_when>2016-03-21 12:20:53 +0000</bug_when>
    <thetext>The issue is easily reproduced by invoking bitbake-selftest locally:

...............................................................................................F........................................................
======================================================================
FAIL: test_wget_latest_versionstring (bb.tests.fetch.FetchLatestVersionTest)
----------------------------------------------------------------------
Traceback (most recent call last):
  File &quot;/home/pokybuild/yocto-autobuilder/yocto-worker/nightly/build/bitbake/lib/bb/tests/fetch.py&quot;, line 758, in test_wget_latest_versionstring
    self.assertTrue(r == -1 or r == 0, msg=&quot;Package %s, version: %s &lt;= %s&quot; % (k[0], v, verstring))
AssertionError: Package cups, version: 2.0.0 &lt;= 

----------------------------------------------------------------------
Ran 152 tests in 74.659s

FAILED (failures=1)</thetext>
  </long_desc><long_desc isprivate="0" >
    <commentid>60200</commentid>
    <comment_count>1</comment_count>
    <who name="Joshua Lock">joshuagloe</who>
    <bug_when>2016-03-21 12:56:58 +0000</bug_when>
    <thetext>Richard has fixed the selftest by updating to the new upstream url:

http://git.openembedded.org/bitbake/commit/?id=5f06041d4936fc22297945bbbad7020bfa9083c6

http://git.yoctoproject.org/cgit/cgit.cgi/poky/commit/?id=8037ba4d86a65ee296cfdcee736dfd614c568818</thetext>
  </long_desc>
      
      

    </bug>

</bugzilla>