<?xml version="1.0" encoding="UTF-8" standalone="yes" ?>
<!DOCTYPE bugzilla SYSTEM "https://bugzilla.yoctoproject.org/page.cgi?id=bugzilla.dtd">

<bugzilla version="5.0.6"
          urlbase="https://bugzilla.yoctoproject.org/"
          
          maintainer="it-coreprojects-helpdesk@linuxfoundation.org"
>

    <bug>
          <bug_id>958</bug_id>
          
          <creation_ts>2011-04-06 22:34:55 +0000</creation_ts>
          <short_desc>autobuilder build failed for qemuppc sato-sdk,lsb in nightly build (20110404-1)</short_desc>
          <delta_ts>2011-04-14 18:35:28 +0000</delta_ts>
          <reporter_accessible>1</reporter_accessible>
          <cclist_accessible>1</cclist_accessible>
          <classification_id>7</classification_id>
          <classification>Build System, Metadata &amp; Runtime</classification>
          <product>OE-Core</product>
          <component>graphics</component>
          <version>unspecified</version>
          <rep_platform>x86</rep_platform>
          <op_sys>ppc</op_sys>
          <bug_status>VERIFIED</bug_status>
          <resolution>DUPLICATE</resolution>
          <dup_id>959</dup_id>
          
          <bug_file_loc></bug_file_loc>
          <status_whiteboard></status_whiteboard>
          <keywords></keywords>
          <priority>Medium</priority>
          <bug_severity>normal</bug_severity>
          <target_milestone>1.1</target_milestone>
          
          
          <everconfirmed>1</everconfirmed>
          <reporter name="liang li">liang.li2</reporter>
          <assigned_to name="Saul Wold">sgw</assigned_to>
          <cc>jiajun.xu</cc>
    
    <cc>ke.yu</cc>
    
    <cc>liangliang.wang</cc>
    
    <cc>meta.mr.watcher</cc>
    
    <cc>meta.watcher</cc>
    
    <cc>poky.bs.watcher</cc>
    
    <cc>poky.watcher</cc>
    
    <cc>sgw</cc>
    
    <cc>yi.zhao</cc>
          
          
          <cf_os>---</cf_os>
          <cf_regression_type>---</cf_regression_type>
          
          <cf_docchange>---</cf_docchange>

      

      

      

          <comment_sort_order>oldest_to_newest</comment_sort_order>  
          <long_desc isprivate="0" >
    <commentid>13148</commentid>
    <comment_count>0</comment_count>
    <who name="liang li">liang.li2</who>
    <bug_when>2011-04-06 22:34:55 +0000</bug_when>
    <thetext>sato-sdk,lsb related rootfs file not found in nightly build 20110404-1:
http://autobuilder.pokylinux.org/nightly/20110404-1/machines/qemu/qemuppc/

git info :
commit f897723207b00b4c9dcdb43107891b7b82ce22f3</thetext>
  </long_desc><long_desc isprivate="0" >
    <commentid>13160</commentid>
    <comment_count>1</comment_count>
    <who name="liang li">liang.li2</who>
    <bug_when>2011-04-07 00:06:51 +0000</bug_when>
    <thetext>Be reminded by jiajun,look at the autobuilder last build logs:
wrong info below :

Building
qemuppc
poky-image-sato poky-image-sato-dev poky-image-sato-sdk poky-image-minimal poky-image-minimal-dev
failed


poky-autobuild poky-image-sato poky-image-sato-dev poky-image-sato-sdk poky-image-minimal poky-image-minimal-dev -k
 in dir /srv/home/pokybuild/poky-slave/nightly-external/build (timeout 14400 secs)
......
OE Build Configuration:
BB_VERSION        = &quot;1.11.0&quot;
METADATA_BRANCH   = &quot;master&quot;
METADATA_REVISION = &quot;f897723207b00b4c9dcdb43107891b7b82ce22f3&quot;
TARGET_ARCH       = &quot;powerpc&quot;
TARGET_OS         = &quot;linux&quot;
MACHINE           = &quot;qemuppc&quot;
DISTRO            = &quot;poky&quot;
DISTRO_VERSION    = &quot;1.0+snapshot-20110405&quot;
TARGET_FPU        = &quot;&quot;

NOTE: Resolving any missing task queue dependencies
NOTE: Preparing runqueue
NOTE: Executing SetScene Tasks
NOTE: Executing RunQueue Tasks
NOTE: Running task 1433 of 6944 (ID: 3106, /srv/home/pokybuild/poky-slave/nightly-external/build/meta/recipes-devtools/binutils/binutils-cross_2.21.bb, do_fetch)

...............

NOTE: Running task 5782 of 6944 (ID: 4781, /srv/home/pokybuild/poky-slave/nightly-external/build/meta/recipes-connectivity/bluez/bluez-hcidump_1.42.bb, do_package_write_rpm)
NOTE: package matchbox-keyboard-0.0+git1+b38f24036cff3be6c2fbcf9ca9881803e69003ac-r0: task do_install: Started
ERROR: Function &apos;do_configure&apos; failed (see /srv/home/pokybuild/poky-slave/nightly-external/build/build/tmp/work/ppc603e-poky-linux/qt4-x11-free-4.7.1-r21.1/temp/log.do_configure.23729 for further information)
ERROR: Logfile of failure stored in: /srv/home/pokybuild/poky-slave/nightly-external/build/build/tmp/work/ppc603e-poky-linux/qt4-x11-free-4.7.1-r21.1/temp/log.do_configure.23729
Log data follows:
| Which edition of Qt do you want to use ?
| 
| Type &apos;c&apos; if you want to use the Commercial Edition.
| Type &apos;o&apos; if you want to use the Open Source Edition.
| 
| 
| Determining system architecture... (Linux:2.6.31.14-0.6-desktop:x86_64)
|     64-bit AMD 80x86 (x86_64)
|     &apos;powerpc&apos; is supported
|     &apos;x86_64&apos; is supported
| System architecture: &apos;powerpc&apos;
| /srv/home/pokybuild/poky-slave/nightly-external/build/build/tmp/work/ppc603e-poky-linux/qt4-x11-free-4.7.1-r21.1/qt-everywhere-opensource-src-4.7.1/config.tests/unix/fvisibility.test: line 28: powerpc-poky-linux-g++ -mcpu=603e  -mhard-float --sysroot=/srv/home/pokybuild/poky-slave/nightly-external/build/build/tmp/sysroots/qemuppc: No such file or directory
| Symbol visibility control disabled.
| Symbolic function binding enabled.
| 
| This is the Qt for Linux/X11 Open Source Edition.
| 
| You are licensed to use this software under the terms of
| the Lesser GNU General Public License (LGPL) versions 2.1.
| You are also licensed to use this software under the terms of
| the GNU General Public License (GPL) versions 3.
| 
| Type &apos;3&apos; to view the GNU General Public License version 3.
| Type &apos;L&apos; to view the Lesser GNU General Public License version 2.1.
| Type &apos;yes&apos; to accept this license offer.
| Type &apos;no&apos; to decline this license offer.
| 
| Do you accept the terms of either license?
| floatmath auto-detection... ()
| compiling floatmath.cpp
| floatmath.cpp:44:5: warning: unused parameter &apos;argc&apos;
| floatmath.cpp:44:5: warning: unused parameter &apos;argv&apos;
| linking floatmath
| floatmath enabled.
| mmx auto-detection... ()
| compiling mmx.cpp
| cc1plus: error: unrecognized command line option &quot;-mmmx&quot;
| make: *** [mmx.o] Error 1
| mmx disabled.
| 3dnow auto-detection... ()
| compiling 3dnow.cpp
| cc1plus: error: unrecognized command line option &quot;-m3dnow&quot;
| make: *** [3dnow.o] Error 1
| 3dnow disabled.
| sse auto-detection... ()
| compiling sse.cpp
| cc1plus: error: unrecognized command line option &quot;-msse&quot;
| make: *** [sse.o] Error 1
| sse disabled.
| sse2 auto-detection... ()
| compiling sse2.cpp
| cc1plus: error: unrecognized command line option &quot;-msse2&quot;
| make: *** [sse2.o] Error 1
| sse2 disabled.
| sse3 auto-detection... ()
| compiling sse3.cpp
| cc1plus: error: unrecognized command line option &quot;-msse3&quot;
| make: *** [sse3.o] Error 1
| sse3 disabled.
| ssse3 auto-detection... ()
| compiling ssse3.cpp
| cc1plus: error: unrecognized command line option &quot;-mssse3&quot;
| make: *** [ssse3.o] Error 1
| ssse3 disabled.
| sse4_1 auto-detection... ()
| compiling sse4_1.cpp
| cc1plus: error: unrecognized command line option &quot;-msse4.1&quot;
| make: *** [sse4_1.o] Error 1
| sse4_1 disabled.
| sse4_2 auto-detection... ()
| compiling sse4_2.cpp
| cc1plus: error: unrecognized command line option &quot;-msse4.2&quot;
| make: *** [sse4_2.o] Error 1
| sse4_2 disabled.
| avx auto-detection... ()
| compiling avx.cpp
| cc1plus: error: unrecognized command line option &quot;-mavx&quot;
| make: *** [avx.o] Error 1
| avx disabled.
| libtiff auto-detection... ()
| compiling libtiff.cpp
| linking libtiff
| libtiff enabled.
| libmng auto-detection... ()
| compiling libmng.cpp
| libmng.cpp:42:20: fatal error: libmng.h: No such file or directory
| compilation terminated.
| make: *** [libmng.o] Error 1
| libmng disabled.
| DB2 auto-detection... ()
| compiling db2.cpp
| db2.cpp:42:20: fatal error: sqlcli.h: No such file or directory
| compilation terminated.
| make: *** [db2.o] Error 1
| DB2 disabled.
| OCI auto-detection... ()
| compiling oci.cpp
| oci.cpp:42:17: fatal error: oci.h: No such file or directory
| compilation terminated.
| make: *** [oci.o] Error 1
| OCI disabled.
| SQLite2 auto-detection... ()
| compiling sqlite2.cpp
| sqlite2.cpp:42:20: fatal error: sqlite.h: No such file or directory
| compilation terminated.
| make: *** [sqlite2.o] Error 1
| SQLite2 disabled.
| unknown SQL driver: sqlite_symbian
| TDS auto-detection... ()
| compiling tds.cpp
| tds.cpp:42:22: fatal error: sybfront.h: No such file or directory
| compilation terminated.
| make: *** [tds.o] Error 1
| TDS disabled.
| POSIX iconv auto-detection... ()
| compiling iconv.cpp
| linking iconv
| POSIX iconv enabled.
| D-Bus auto-detection... ()
| compiling dbus.cpp
| linking dbus
| D-Bus enabled.
| Glib auto-detection... ()
| compiling glib.cpp
| glib.cpp: In function &apos;int main(int, char**)&apos;:
| glib.cpp:55:38: wERROR: Function &apos;do_configure&apos; failed (see /srv/home/pokybuild/poky-slave/nightly-external/build/build/tmp/work/ppc603e-poky-linux/qt4-x11-free-4.7.1-r21.1/temp/log.do_configure.23729 for further information)
| arning: &apos;pollfd&apos; is used uninitialized in this function
| linking glib
| Glib enabled.
| GStreamer auto-detection... ()
| compiling gstreamer.cpp
| gstreamer.cpp:53:5: warning: unused parameter &apos;argc&apos;
| gstreamer.cpp:53:5: warning: unused parameter &apos;argv&apos;
| linking gstreamer
| GStreamer enabled.
| ICD auto-detection... ()
| compiling icd.cpp
| icd.cpp:42:37: fatal error: libicd-network-wlan-dev.h: No such file or directory
| compilation terminated.
| make: *** [icd.o] Error 1
| ICD disabled.
| PulseAudio auto-detection... ()
| compiling pulseaudio.cpp
| pulseaudio.cpp:42:30: fatal error: pulse/pulseaudio.h: No such file or directory
| compilation terminated.
| make: *** [pulseaudio.o] Error 1
| PulseAudio disabled.
| Detecting broken X11 headers... (/srv/home/pokybuild/poky-slave/nightly-external/build/build/tmp/work/ppc603e-poky-linux/qt4-x11-free-4.7.1-r21.1/qt-everywhere-opensource-src-4.7.1/mkspecs/linux-oe-g++ yes /srv/home/pokybuild/poky-slave/nightly-external/build/build/tmp/work/ppc603e-poky-linux/qt4-x11-free-4.7.1-r21.1/qt-everywhere-opensource-src-4.7.1 /srv/home/pokybuild/poky-slave/nightly-external/build/build/tmp/work/ppc603e-poky-linux/qt4-x11-free-4.7.1-r21.1/qt-everywhere-opensource-src-4.7.1)
| X11 headers look good.
| XLib auto-detection... ()
| compiling xlib.cpp
| linking xlib
| XLib enabled.
| OpenGL auto-detection... ()
| compiling opengl.cpp
| opengl.cpp:42:19: fatal error: GL/gl.h: No such file or directory
| compilation terminated.
| make: *** [opengl.o] Error 1
| OpenGL disabled.
| OpenGL ES 2.x auto-detection... ()
| compiling opengles2.cpp
| opengles2.cpp:42:23: fatal error: GLES2/gl2.h: No such file or directory
| compilation terminated.
| make: *** [opengles2.o] Error 1
| OpenGL ES 2.x disabled.
| OpenGL ES 1.x auto-detection... ()
| compiling opengles1.cpp
| opengles1.cpp:42:21: fatal error: GLES/gl.h: No such file or directory
| compilation terminated.
| make: *** [opengles1.o] Error 1
| OpenGL ES 1.x disabled.
| All the OpenGL functionality tests failed!
|  You might need to modify the include and library search paths by editing
|  QMAKE_INCDIR_OPENGL, QMAKE_LIBDIR_OPENGL and QMAKE_LIBS_OPENGL in
|  /srv/home/pokybuild/poky-slave/nightly-external/build/build/tmp/work/ppc603e-poky-linux/qt4-x11-free-4.7.1-r21.1/qt-everywhere-opensource-src-4.7.1/mkspecs/linux-oe-g++.
NOTE: package qt4-x11-free-4.7.1-r21.1: task do_configure: Failed
ERROR: Task 4638 (/srv/home/pokybuild/poky-slave/nightly-external/build/meta/recipes-qt/qt4/qt4-x11-free_4.7.1.bb, do_configure) failed with exit code &apos;1&apos;
......
NOTE: Running task 6902 of 6944 (ID: 80, /srv/home/pokybuild/poky-slave/nightly-external/build/meta/recipes-core/images/poky-image-minimal-dev.bb, do_rm_work_all)
NOTE: package poky-image-minimal-dev-1.0-r0: task do_rm_work_all: Started
NOTE: package poky-image-minimal-dev-1.0-r0: task do_rm_work_all: Succeeded
ERROR: &apos;/srv/home/pokybuild/poky-slave/nightly-external/build/meta/recipes-qt/qt4/qt4-x11-free_4.7.1.bb&apos; failed
program finished with exit code 1</thetext>
  </long_desc><long_desc isprivate="0" >
    <commentid>13162</commentid>
    <comment_count>2</comment_count>
    <who name="liang li">liang.li2</who>
    <bug_when>2011-04-07 00:10:32 +0000</bug_when>
    <thetext>related logs link:
http://autobuilder.pokylinux.org:8010/builders/nightly-external/builds/90/steps/shell_15/logs/stdio</thetext>
  </long_desc><long_desc isprivate="0" >
    <commentid>13164</commentid>
    <comment_count>3</comment_count>
    <who name="liang li">liang.li2</who>
    <bug_when>2011-04-07 00:27:55 +0000</bug_when>
    <thetext>and the same build error also happened on lsb-sdk nightly build 20110404-1.
log link:
http://autobuilder.pokylinux.org:8010/builders/nightly-external-lsb/builds/9/steps/shell_9/logs/stdio</thetext>
  </long_desc><long_desc isprivate="0" >
    <commentid>13186</commentid>
    <comment_count>4</comment_count>
    <who name="Saul Wold">sgw</who>
    <bug_when>2011-04-08 15:07:54 +0000</bug_when>
    <thetext>This is clearly a duplicate of 959, I am keeping 959 since it has a much clear bug title.

I am working on a fix currently to add virtual/libgl to the DEPENDS, need to verify this will work for machines without a libgl (mesa) implementation correctly.

*** This bug has been marked as a duplicate of bug 959 ***</thetext>
  </long_desc><long_desc isprivate="0" >
    <commentid>13252</commentid>
    <comment_count>5</comment_count>
    <who name="liang li">liang.li2</who>
    <bug_when>2011-04-12 19:15:34 +0000</bug_when>
    <thetext>From autobuilder newest build logs, no such error happened.</thetext>
  </long_desc><long_desc isprivate="0" >
    <commentid>13290</commentid>
    <comment_count>6</comment_count>
    <who name="liang li">liang.li2</who>
    <bug_when>2011-04-14 18:35:28 +0000</bug_when>
    <thetext>verified on qemuppc nightly build 20110412-1:
http://autobuilder.pokylinux.org/nightly/20110412-1/machines/qemu/qemuppc/
git info :
6bf6aec120744211fbabf2b4a167bfd1ab5866fd
both lsb and sato-sdk images has been built out.</thetext>
  </long_desc>
      
      

    </bug>

</bugzilla>