<?xml version="1.0" encoding="UTF-8" standalone="yes" ?>
<!DOCTYPE bugzilla SYSTEM "https://bugzilla.yoctoproject.org/page.cgi?id=bugzilla.dtd">

<bugzilla version="5.0.6"
          urlbase="https://bugzilla.yoctoproject.org/"
          
          maintainer="it-coreprojects-helpdesk@linuxfoundation.org"
>

    <bug>
          <bug_id>974</bug_id>
          
          <creation_ts>2011-04-12 14:31:32 +0000</creation_ts>
          <short_desc>ERROR: Task 8 (/work/rber/poky/meta/recipes-sato/web/web_svn.bb, do_compile) failed with exit code &apos;1&apos;</short_desc>
          <delta_ts>2011-05-13 11:00:52 +0000</delta_ts>
          <reporter_accessible>1</reporter_accessible>
          <cclist_accessible>1</cclist_accessible>
          <classification_id>7</classification_id>
          <classification>Build System, Metadata &amp; Runtime</classification>
          <product>OE-Core</product>
          <component>core</component>
          <version>1.0</version>
          <rep_platform>Other</rep_platform>
          <op_sys>x86</op_sys>
          <bug_status>RESOLVED</bug_status>
          <resolution>FIXED</resolution>
          
          
          <bug_file_loc></bug_file_loc>
          <status_whiteboard></status_whiteboard>
          <keywords></keywords>
          <priority>Medium</priority>
          <bug_severity>normal</bug_severity>
          <target_milestone>1.1</target_milestone>
          
          
          <everconfirmed>1</everconfirmed>
          <reporter name="Robert Berger">pokylinux</reporter>
          <assigned_to name="Saul Wold">sgw</assigned_to>
          <cc>meta.mr.watcher</cc>
    
    <cc>meta.watcher</cc>
    
    <cc>poky.bs.watcher</cc>
    
    <cc>poky.watcher</cc>
    
    <cc>sgw</cc>
          
          
          <cf_os>---</cf_os>
          <cf_regression_type>---</cf_regression_type>
          
          <cf_docchange>---</cf_docchange>

      

      

      

          <comment_sort_order>oldest_to_newest</comment_sort_order>  
          <long_desc isprivate="0" >
    <commentid>13231</commentid>
    <comment_count>0</comment_count>
    <who name="Robert Berger">pokylinux</who>
    <bug_when>2011-04-12 14:31:32 +0000</bug_when>
    <thetext>Working with the bernard-5.0 release tag:

bitbake web fails

OE Build Configuration:
BB_VERSION        = &quot;1.11.0&quot;
METADATA_BRANCH   = &quot;bernard-5.0_LOCAL&quot;
METADATA_REVISION = &quot;8b6416db1e04af83ecdf57522240ac859d5d8031&quot;
TARGET_ARCH       = &quot;i586&quot;
TARGET_OS         = &quot;linux&quot;
MACHINE           = &quot;qemux86&quot;
DISTRO            = &quot;poky&quot;
DISTRO_VERSION    = &quot;1.0&quot;
TARGET_FPU        = &quot;&quot;

NOTE: Resolving any missing task queue dependencies
Log data follows:
| NOTE: make -j 2
| Making all in src
| make[1]: Entering directory `/work/rber/poky-bernard-5.0-x86-qemu/tmp/work/i586-poky-linux/web-0.0+svnr129-r4/trunk/src&apos;
| make  all-recursive
| make[2]: Entering directory `/work/rber/poky-bernard-5.0-x86-qemu/tmp/work/i586-poky-linux/web-0.0+svnr129-r4/trunk/src&apos;
| Making all in gtkhtml2
| make[3]: Entering directory `/work/rber/poky-bernard-5.0-x86-qemu/tmp/work/i586-poky-linux/web-0.0+svnr129-r4/trunk/src/gtkhtml2&apos;

...

/qemux86/usr/include/libpng12 -fexpensive-optimizations -fomit-frame-pointer -frename-registers -O2 -ggdb -feliminate-unused-debug-types -MT libwebgtkhtml2_la-web_gtkhtml2_js.lo -MD -MP -MF .deps/libwebgtkhtml2_la-web_gtkhtml2_js.Tpo -c web_gtkhtml2_js.c  -fPIC -DPIC -o .libs/libwebgtkhtml2_la-web_gtkhtml2_js.o
| web_gtkhtml2.c: In function &apos;web_gtkhtml2_title_tooltip_cb&apos;:
| web_gtkhtml2.c:200:4: warning: passing argument 2 of &apos;strcasecmp&apos; makes pointer from integer without a cast
| /work/rber/poky-bernard-5.0-x86-qemu/tmp/sysroots/qemux86/usr/include/string.h:536:12: note: expected &apos;const char *&apos; but argument is of type &apos;int&apos;
| web_gtkhtml2.c: In function &apos;web_gtkhtml2_new&apos;:
| web_gtkhtml2.c:299:2: warning: passing argument 1 of &apos;gtk_widget_show_all&apos; from incompatible pointer type
| /work/rber/poky-bernard-5.0-x86-qemu/tmp/sysroots/qemux86/usr/include/gtk-2.0/gtk/gtkwidget.h:851:9: note: expected &apos;struct GtkWidget *&apos; but argument is of type &apos;struct HtmlView *&apos;
| web_gtkhtml2.c:301:2: warning: return from incompatible pointer type
| web_gtkhtml2.c: In function &apos;web_gtkhtml2_add_style&apos;:
| web_gtkhtml2.c:525:3: error: too many arguments to function &apos;css_parser_parse_stylesheet&apos;
| /work/rber/poky-bernard-5.0-x86-qemu/tmp/sysroots/qemux86/usr/include/gtkhtml-2.0/libgtkhtml/css/cssparser.h:32:16: note: declared here
| make[3]: *** [libwebgtkhtml2_la-web_gtkhtml2.lo] Error 1
| make[3]: *** Waiting for unfinished jobs....
| web_gtkhtml2_js.c: In function &apos;web_gtkhtml2_js_HTMLElement_addEventListener&apos;:
| web_gtkhtml2_js.c:549:18: warning: assignment makes pointer from integer without a cast
| web_gtkhtml2_js.c: In function &apos;web_gtkhtml2_js_HTMLElement_insertBefore&apos;:
| web_gtkhtml2_js.c:607:9: warning: assignment makes pointer from integer without a cast
| web_gtkhtml2_js.c: In function &apos;web_gtkhtml2_js_HTMLElement_setAttribute&apos;:
| web_gtkhtml2_js.c:670:2: warning: passing argument 2 of &apos;dom_Element_setAttribute&apos; discards qualifiers from pointer target type
| /work/rber/poky-bernard-5.0-x86-qemu/tmp/sysroots/qemux86/usr/include/gtkhtml-2.0/libgtkhtml/dom/core/dom-element.h:54:6: note: expected &apos;DomString *&apos; but argument is of type &apos;const gchar *&apos;
| web_gtkhtml2_js.c: In function &apos;web_gtkhtml2_js_HTMLDocument_getProperty&apos;:
| web_gtkhtml2_js.c:925:19: warning: initialization makes pointer from integer without a cast
| web_gtkhtml2_js.c:942:6: warning: passing argument 2 of &apos;web_gtkhtml2_dom_find&apos; from incompatible pointer type
| web_gtkhtml2.h:47:10: note: expected &apos;GEqualFunc&apos; but argument is of type &apos;gboolean (*)(void *, void *)&apos;
| web_gtkhtml2_js.c: In function &apos;web_gtkhtml2_js_Style_setProperty&apos;:
| web_gtkhtml2_js.c:1235:8: warning: assignment makes pointer from integer without a cast
| web_gtkhtml2_js.c:1238:8: warning: assignment makes pointer from integer without a cast
| web_gtkhtml2_js.c: In function &apos;web_gtkhtml2_js_parse&apos;:
| web_gtkhtml2_js.c:1318:3: warning: passing argument 6 of &apos;JS_EvaluateScript&apos; makes integer from pointer without a cast
| /work/rber/poky-bernard-5.0-x86-qemu/tmp/sysroots/qemux86/usr/include/js/jsapi.h:2088:1: note: expected &apos;uintN&apos; but argument is of type &apos;char *&apos;
| web_gtkhtml2_js.c: In function &apos;web_gtkhtml2_js_init&apos;:
| web_gtkhtml2_js.c:1460:2: warning: passing argument 2 of &apos;g_hash_table_foreach_remove&apos; from incompatible pointer type
| /work/rber/poky-bernard-5.0-x86-qemu/tmp/sysroots/qemux86/usr/include/glib-2.0/glib/ghash.h:91:11: note: expected &apos;GHRFunc&apos; but argument is of type &apos;const gboolean (*)(void)&apos;
| web_gtkhtml2_js.c:1471:2: warning: passing argument 7 of &apos;JS_InitClass&apos; from incompatible pointer type
| /work/rber/poky-bernard-5.0-x86-qemu/tmp/sysroots/qemux86/usr/include/js/jsapi.h:1480:1: note: expected &apos;struct JSPropertySpec *&apos; but argument is of type &apos;struct JSPropertySpec (*)[24]&apos;
| web_gtkhtml2_js.c:1471:2: warning: passing argument 8 of &apos;JS_InitClass&apos; from incompatible pointer type
| /work/rber/poky-bernard-5.0-x86-qemu/tmp/sysroots/qemux86/usr/include/js/jsapi.h:1480:1: note: expected &apos;struct JSFunctionSpec *&apos; but argument is of type &apos;struct JSFunctionSpec (*)[7]&apos;
| web_gtkhtml2_js.c:1478:2: warning: passing argument 7 of &apos;JS_InitClass&apos; from incompatible pointer type
| /work/rber/poky-bernard-5.0-x86-qemu/tmp/sysroots/qemux86/usr/include/js/jsapi.h:1480:1: note: expected &apos;struct JSPropertySpec *&apos; but argument is of type &apos;struct JSPropertySpec (*)[5]&apos;
| web_gtkhtml2_js.c:1478:2: warning: passing argument 8 of &apos;JS_InitClass&apos; from incompatible pointer type
| /work/rber/poky-bernard-5.0-x86-qemu/tmp/sysroots/qemux86/usr/include/js/jsapi.h:1480:1: note: expected &apos;struct JSFunctionSpec *&apos; but argument is of type &apos;struct JSFunctionSpec (*)[6]&apos;
| web_gtkhtml2_js.c:1485:2: warning: passing argument 7 of &apos;JS_InitClass&apos; from incompatible pointer type
| /work/rber/poky-bernard-5.0-x86-qemu/tmp/sysroots/qemux86/usr/include/js/jsapi.h:1480:1: note: expected &apos;struct JSPropertySpec *&apos; but argument is of type &apos;struct JSPropertySpec (*)[1]&apos;
| web_gtkhtml2_js.c:1485:2: warning: passing argument 8 of &apos;JS_InitClass&apos; from incompatible pointer type
| /work/rber/poky-bernard-5.0-x86-qemu/tmp/sysroots/qemux86/usr/include/js/jsapi.h:1480:1: note: expected &apos;struct JSFunctionSpec *&apos; but argument is of type &apos;struct JSPropertySpec (*)[1]&apos;
| web_gtkhtml2_js.c:1489:2: warning: passing argument 3 of &apos;JS_DefineFunctions&apos; from incompatible pointer type
| /work/rber/poky-bernard-5.0-x86-qemu/tmp/sysroots/qemux86/usr/include/js/jsapi.h:1902:1: note: expected &apos;struct JSFunctionSpec *&apos; but argument is of type &apos;struct JSPropertySpec *&apos;
| web_gtkhtml2_js.c:1492:2: warning: passing argument 7 of &apos;JS_InitClass&apos; from incompatible pointer type
| /work/rber/poky-bernard-5.0-x86-qemu/tmp/sysroots/qemux86/usr/include/js/jsapi.h:1480:1: note: expected &apos;struct JSPropertySpec *&apos; but argument is of type &apos;struct JSPropertySpec (*)[3]&apos;
| web_gtkhtml2_js.c:1492:2: warning: passing argument 8 of &apos;JS_InitClass&apos; from incompatible pointer type
| /work/rber/poky-bernard-5.0-x86-qemu/tmp/sysroots/qemux86/usr/include/js/jsapi.h:1480:1: note: expected &apos;struct JSFunctionSpec *&apos; but argument is of type &apos;struct JSPropertySpec (*)[1]&apos;
| web_gtkhtml2_js.c:1496:2: warning: passing argument 3 of &apos;JS_DefineFunctions&apos; from incompatible pointer type
| /work/rber/poky-bernard-5.0-x86-qemu/tmp/sysroots/qemux86/usr/include/js/jsapi.h:1902:1: note: expected &apos;struct JSFunctionSpec *&apos; but argument is of type &apos;struct JSPropertySpec *&apos;
| web_gtkhtml2_js.c:1499:2: warning: passing argument 7 of &apos;JS_InitClass&apos; from incompatible pointer type
| /work/rber/poky-bernard-5.0-x86-qemu/tmp/sysroots/qemux86/usr/include/js/jsapi.h:1480:1: note: expected &apos;struct JSPropertySpec *&apos; but argument is of type &apos;struct JSPropertySpec (*)[4]&apos;
| web_gtkhtml2_js.c:1499:2: warning: passing argument 8 of &apos;JS_InitClass&apos; from incompatible pointer type
| /work/rber/poky-bernard-5.0-x86-qemu/tmp/sysroots/qemux86/usr/include/js/jsapi.h:1480:1: note: expected &apos;struct JSFunctionSpec *&apos; but argument is of type &apos;struct JSPropertySpec (*)[1]&apos;
| web_gtkhtml2_js.c:1503:2: warning: passing argument 3 of &apos;JS_DefineFunctions&apos; from incompatible pointer type
| /work/rber/poky-bernard-5.0-x86-qemu/tmp/sysroots/qemux86/usr/include/js/jsapi.h:1902:1: note: expected &apos;struct JSFunctionSpec *&apos; but argument is of type &apos;struct JSPropertySpec *&apos;
| web_gtkhtml2_js.c: In function &apos;web_gtkhtml2_js_run&apos;:
| web_gtkhtml2_js.c:1687:3: warning: passing argument 1 of &apos;dom_Attr__get_name&apos; from incompatible pointer type
| /work/rber/poky-bernard-5.0-x86-qemu/tmp/sysroots/qemux86/usr/include/gtkhtml-2.0/libgtkhtml/dom/core/dom-attr.h:45:12: note: expected &apos;struct DomAttr *&apos; but argument is of type &apos;struct DomNode *&apos;
| web_gtkhtml2_js.c:1688:3: warning: passing argument 1 of &apos;dom_Attr__get_value&apos; from incompatible pointer type
| /work/rber/poky-bernard-5.0-x86-qemu/tmp/sysroots/qemux86/usr/include/gtkhtml-2.0/libgtkhtml/dom/core/dom-attr.h:46:12: note: expected &apos;struct DomAttr *&apos; but argument is of type &apos;struct DomNode *&apos;
| web_gtkhtml2_js.c:1720:16: warning: assignment makes pointer from integer without a cast
| web_gtkhtml2_js.c: In function &apos;web_gtkhtml2_js_HTMLElement_addEventListener&apos;:
| web_gtkhtml2_js.c:550:17: warning: ignoring return value of &apos;g_list_prepend&apos;, declared with attribute warn_unused_result
| i586-poky-linux-libtool: compile:  i586-poky-linux-gcc -march=i586 | mv -f .deps/libwebgtkhtml2_la-web_gtkhtml2_js.Tpo .deps/libwebgtkhtml2_la-web_gtkhtml2_js.Plo
| make[3]: Leaving directory `/work/rber/poky-bernard-5.0-x86-qemu/tmp/work/i586-poky-linux/web-0.0+svnr129-r4/trunk/src/gtkhtml2&apos;
| make[2]: *** [all-recursive] Error 1
| make[2]: Leaving directory `/work/rber/poky-bernard-5.0-x86-qemu/tmp/work/i586-poky-linux/web-0.0+svnr129-r4/trunk/src&apos;
| make[1]: *** [all] Error 2
| make[1]: Leaving directory `/work/rber/poky-bernard-5.0-x86-qemu/tmp/work/i586-poky-linux/web-0.0+svnr129-r4/trunk/src&apos;
| make: *** [all-recursive] Error 1
| FATAL: oe_runmake failed
| ERROR: Function &apos;do_compile&apos; failed (see /work/rber/poky-bernard-5.0-x86-qemu/tmp/work/i586-poky-linux/web-0.0+svnr129-r4/temp/log.do_compile.23371 for further information)
NOTE: package web-0.0+svnr129-r4: task do_compile: Failed
ERROR: Task 8 (/work/rber/poky/meta/recipes-sato/web/web_svn.bb, do_compile) failed with exit code &apos;1&apos;
ERROR: &apos;/work/rber/poky/meta/recipes-sato/web/web_svn.bb&apos; failed
rber@yocto-vm-1:~/projects/yocto/yocto_for_trainer/sandbox_work$ cat /work/rber/poky-bernard-5.0-x86-qemu/tmp/work/i586-poky-linux/web-0.0+svnr129-r4/temp/log.do_compile.23371
NOTE: make -j 2
Making all in src
make[1]: Entering directory `/work/rber/poky-bernard-5.0-x86-qemu/tmp/work/i586-poky-linux/web-0.0+svnr129-r4/trunk/src&apos;
make  all-recursive
make[2]: Entering directory `/work/rber/poky-bernard-5.0-x86-qemu/tmp/work/i586-poky-linux/web-0.0+svnr129-r4/trunk/src&apos;
Making all in gtkhtml2
make[3]: Entering directory `/work/rber/poky-bernard-5.0-x86-qemu/tmp/work/i586-

...

mv -f .deps/libwebgtkhtml2_la-web_gtkhtml2_js.Tpo .deps/libwebgtkhtml2_la-web_gtkhtml2_js.Plo
make[3]: Leaving directory `/work/rber/poky-bernard-5.0-x86-qemu/tmp/work/i586-poky-linux/web-0.0+svnr129-r4/trunk/src/gtkhtml2&apos;
make[2]: *** [all-recursive] Error 1
make[2]: Leaving directory `/work/rber/poky-bernard-5.0-x86-qemu/tmp/work/i586-poky-linux/web-0.0+svnr129-r4/trunk/src&apos;
make[1]: *** [all] Error 2
make[1]: Leaving directory `/work/rber/poky-bernard-5.0-x86-qemu/tmp/work/i586-poky-linux/web-0.0+svnr129-r4/trunk/src&apos;
make: *** [all-recursive] Error 1
FATAL: oe_runmake failed
ERROR: Function &apos;do_compile&apos; failed (see /work/rber/poky-bernard-5.0-x86-qemu/tmp/work/i586-poky-linux/web-0.0+svnr129-r4/temp/log.do_compile.23371 for further information)</thetext>
  </long_desc><long_desc isprivate="0" >
    <commentid>13236</commentid>
    <comment_count>1</comment_count>
    <who name="Saul Wold">sgw</who>
    <bug_when>2011-04-12 15:40:37 +0000</bug_when>
    <thetext>I am working on a patch for this right now.

--- trunk.orig/src/gtkhtml2/web_gtkhtml2.c	2011-02-11 02:34:02.000000000 -0800
+++ trunk/src/gtkhtml2/web_gtkhtml2.c	2011-04-12 15:26:52.476000021 -0700
@@ -522,7 +522,7 @@
 	css-&gt;style = g_strdup (style);
 	css-&gt;media = g_strdup (media);
 	css-&gt;sheet = css_parser_parse_stylesheet (css-&gt;style,
-		strlen (css-&gt;style), NULL, css-&gt;media);
+		strlen (css-&gt;style));
 	data-&gt;sheets = g_slist_prepend (
 		data-&gt;sheets, css);</thetext>
  </long_desc><long_desc isprivate="0" >
    <commentid>13237</commentid>
    <comment_count>2</comment_count>
    <who name="Saul Wold">sgw</who>
    <bug_when>2011-04-12 15:57:08 +0000</bug_when>
    <thetext>Working to get a fix into the upstream project dircetly, since this is an SVN based upstream.</thetext>
  </long_desc><long_desc isprivate="0" >
    <commentid>13427</commentid>
    <comment_count>3</comment_count>
    <who name="Saul Wold">sgw</who>
    <bug_when>2011-04-26 08:29:38 +0000</bug_when>
    <thetext>Fixed in Upstream</thetext>
  </long_desc><long_desc isprivate="0" >
    <commentid>13497</commentid>
    <comment_count>4</comment_count>
    <who name="Saul Wold">sgw</who>
    <bug_when>2011-04-28 21:18:04 +0000</bug_when>
    <thetext>http://git.yoctoproject.org/cgit/cgit.cgi/poky/commit/?id=335ff67e0032952d7df7a2beee34a7d8cd69ddc6</thetext>
  </long_desc><long_desc isprivate="0" >
    <commentid>13808</commentid>
    <comment_count>5</comment_count>
    <who name="Saul Wold">sgw</who>
    <bug_when>2011-05-13 11:00:52 +0000</bug_when>
    <thetext>
Bernard
http://git.yoctoproject.org/cgit/cgit.cgi/poky/commit/?id=1d8535ccb7615839487466a18cae7ca9db86711d</thetext>
  </long_desc>
      
      

    </bug>

</bugzilla>