Bug 10167

Summary: gcc 6.1.1 : checking whether your compiler passes the ACC conformance test... FAILED
Product: [Build System, Metadata & Runtime] BitBake Reporter: Lukasz Majewski <l.majewski>
Component: bitbakeAssignee: Tim Orling <tim.orling>
Status: RESOLVED FIXED QA Contact:
Severity: normal    
Priority: Medium CC: akuster, poky.bs.watcher, poky.watcher, sgw
Version: 2.1.2   
Target Milestone: 2.1.2   
Hardware: x86   
OS: arm   
Whiteboard: krogoth backport
OS type for building Yocto: --- Type of Regression: ---
Verified: Documentation change: No (bug/feature does not impact docs)
Attachments:
Description Flags
Build log none

Description Lukasz Majewski 2016-08-19 21:33:29 UTC
Created attachment 3371 [details]
Build log

The "lzop-native-1.03-r0" compilation fails.

The exact reason: 
| checking for vsnprintf... yes
| checking whether your compiler passes the ACC conformance test... FAILED
| configure:
| configure: Your compiler failed the ACC conformance test - for details see
| configure: `config.log'. Please check that log file and consider sending
| configure: a patch or bug-report to <lzop-bugs@oberhumer.com>.
| configure: Thanks for your support.
| configure:
| configure: error: ACC conformance test failed. Stop.
| NOTE: The following config.log files may provide further information.
| WARNING: /opt/work/lukma/yocto/fsl-community-bsp/build/tmp/work/x86_64-linux/lzop-native/1.03-r0/temp/run.do_configure.15264:1 exit 1 from 'exit 1'
| NOTE: /opt/work/lukma/yocto/fsl-community-bsp/build/tmp/work/x86_64-linux/lzop-native/1.03-r0/build/config.log


GCC 6.1.1:

[xxx@YYYYYYY yocto]$ gcc --version
gcc (GCC) 6.1.1 20160621 (Red Hat 6.1.1-3)
Copyright (C) 2016 Free Software Foundation, Inc.

PC:
Fedora 24.

The problem has been mentioned in following issue:
https://github.com/mxe/mxe/issues/1351
Comment 1 Tim Orling 2016-08-25 14:52:20 UTC
Need to back port patch to krogoth

http://git.yoctoproject.org/cgit/cgit.cgi/poky/commit/?id=b5c1f588320e6b1f1804803de9abc0bf71976f3e