| Summary: | core-image-minimal: do_testsdkext failed | ||
|---|---|---|---|
| Product: | [Build System, Metadata & Runtime] OE-Core | Reporter: | Robert Yang <liezhi.yang> |
| Component: | devtools / tool chain | Assignee: | Francisco Pedraza <francisco.j.pedraza.gonzalez> |
| Status: | VERIFIED FIXED | QA Contact: | Jose Perez C <jose.perez.carranza> |
| Severity: | major | ||
| Priority: | Medium+ | CC: | francisco.j.pedraza.gonzalez, jose.perez.carranza, meta.mr.watcher, meta.watcher, sonia.delgado |
| Version: | 2.3 | ||
| Target Milestone: | 2.3 M3 | ||
| Hardware: | x86 | ||
| OS: | Multiple | ||
| Whiteboard: | |||
| OS type for building Yocto: | --- | Type of Regression: | --- |
| Verified: | Documentation change: | Don't know | |
| Bug Depends on: | |||
| Bug Blocks: | 10693 | ||
BTW, this only happens when multilib is enabled: require conf/multilib.conf MULTILIBS = "multilib:lib32" DEFAULTTUNE_virtclass-multilib-lib32 = "x86" Wondering if we're missing a test case for multilib eSDK on the autobuilder too? If we are that should be a separate bug. Yes, indeed, filed a bug for automated runtime testing: https://bugzilla.yoctoproject.org/show_bug.cgi?id=10693 (In reply to comment #3) > Yes, indeed, filed a bug for automated runtime testing: > > https://bugzilla.yoctoproject.org/show_bug.cgi?id=10693 Hi Robert, Any update on this? Regards (In reply to comment #4) > (In reply to comment #3) > > Yes, indeed, filed a bug for automated runtime testing: > > > > https://bugzilla.yoctoproject.org/show_bug.cgi?id=10693 > > Hi Robert, > Any update on this? > Regards Paco, can you execute the steps again on latest master's HEAD? This may be already working. (In reply to comment #5) > (In reply to comment #4) > > (In reply to comment #3) > > > Yes, indeed, filed a bug for automated runtime testing: > > > > > > https://bugzilla.yoctoproject.org/show_bug.cgi?id=10693 > > > > Hi Robert, > > Any update on this? > > Regards > > Paco, can you execute the steps again on latest master's HEAD? This may be > already working. OK Leo, working on it. I just tested this one, and is working good. core-image-minimal-1.0-r0 do_testsdkext: GccCompileTest class: SDK doesn't contain a cross-canadian toolchain core-image-minimal-1.0-r0 do_testsdkext: RESULTS - perl.PerlTest.test_perl_exists - Testcase -1: SKIPPED core-image-minimal-1.0-r0 do_testsdkext: No perl package in the SDK core-image-minimal-1.0-r0 do_testsdkext: RESULTS - perl.PerlTest.test_perl_works - Testcase -1: SKIPPED core-image-minimal-1.0-r0 do_testsdkext: No perl package in the SDK core-image-minimal-1.0-r0 do_testsdkext: RESULTS - python.PythonTest.test_python_exists - Testcase -1: SKIPPED core-image-minimal-1.0-r0 do_testsdkext: No python package in the SDK core-image-minimal-1.0-r0 do_testsdkext: RESULTS - python.PythonTest.test_python_stdout - Testcase -1: SKIPPED core-image-minimal-1.0-r0 do_testsdkext: No python package in the SDK core-image-minimal-1.0-r0 do_testsdkext: RESULTS - python.PythonTest.test_python_testfile - Testcase -1: SKIPPED core-image-minimal-1.0-r0 do_testsdkext: No python package in the SDK core-image-minimal-1.0-r0 do_testsdkext: RESULTS - devtool.DevtoolTest.test_devtool_add_reset - Testcase -1: PASSED core-image-minimal-1.0-r0 do_testsdkext: RESULTS - devtool.DevtoolTest.test_devtool_build_cmake - Testcase 1479: PASSED core-image-minimal-1.0-r0 do_testsdkext: RESULTS - devtool.DevtoolTest.test_devtool_build_esdk_package - Testcase 1474: PASSED core-image-minimal-1.0-r0 do_testsdkext: RESULTS - devtool.DevtoolTest.test_devtool_build_make - Testcase 1473: PASSED core-image-minimal-1.0-r0 do_testsdkext: RESULTS - devtool.DevtoolTest.test_devtool_kernelmodule - Testcase 1484: PASSED core-image-minimal-1.0-r0 do_testsdkext: RESULTS - devtool.DevtoolTest.test_devtool_location - Testcase -1: PASSED core-image-minimal-1.0-r0 do_testsdkext: RESULTS - devtool.DevtoolTest.test_extend_autotools_recipe_creation - Testcase 1482: PASSED core-image-minimal-1.0-r0 do_testsdkext: RESULTS - devtool.DevtoolTest.test_recipes_for_nodejs - Testcase 1478: PASSED core-image-minimal-1.0-r0 do_testsdkext: RESULTS - sdk_update.SdkUpdateTest.test_sdk_update_http - Testcase -1: PASSED NOTE: Tasks Summary: Attempted 1 tasks of which 0 didn't need to be rerun and all succeeded. |
MACHINE = "qemux86-64" $ bitbake core-image-minimal -cpopulate_sdk_ext $ bitbake core-image-minimal -ctestsdkext core-image-minimal-1.0-r0 do_testsdkext: test_cvs (oeqa.sdk.buildcvs.BuildCvsTest) ... ok core-image-minimal-1.0-r0 do_testsdkext: skipped "buildgalculator: Image doesn't have gtk+3 in manifest" core-image-minimal-1.0-r0 do_testsdkext: test_iptables (oeqa.sdk.buildiptables.BuildIptablesTest) ... ok core-image-minimal-1.0-r0 do_testsdkext: skipped "gcc: SDK doesn't contain a cross-canadian toolchain" core-image-minimal-1.0-r0 do_testsdkext: skipped 'perl: No perl package in the SDK' core-image-minimal-1.0-r0 do_testsdkext: skipped 'python: No python package in the SDK' core-image-minimal-1.0-r0 do_testsdkext: core-image-minimal-1.0-r0 do_testsdkext: ---------------------------------------------------------------------- core-image-minimal-1.0-r0 do_testsdkext: Ran 2 tests in 88.399s core-image-minimal-1.0-r0 do_testsdkext: core-image-minimal-1.0-r0 do_testsdkext: OK (skipped=4) core-image-minimal-1.0-r0 do_testsdkext: core-image-minimal SDK(poky-glibc-x86_64-core-image-minimal-core2-64-toolchain-ext-2.2.sh):environment-setup-core2-64-poky-linux - Ran 2 tests in 88.400s core-image-minimal-1.0-r0 do_testsdkext: core-image-minimal - OK - All required tests passed (skipped=4) core-image-minimal-1.0-r0 do_testsdkext: Testing /buildarea/lyang1/test_po/tmp/work/qemux86_64-poky-linux/core-image-minimal/1.0-r0/testsdkext//tc/environment-setup-x86-pokymllib32-linux core-image-minimal-1.0-r0 do_testsdkext: test_cvs (oeqa.sdk.buildcvs.BuildCvsTest) ... FAIL core-image-minimal-1.0-r0 do_testsdkext: skipped "buildgalculator: Image doesn't have gtk+3 in manifest" core-image-minimal-1.0-r0 do_testsdkext: test_iptables (oeqa.sdk.buildiptables.BuildIptablesTest) ... FAIL core-image-minimal-1.0-r0 do_testsdkext: skipped "gcc: SDK doesn't contain a cross-canadian toolchain" core-image-minimal-1.0-r0 do_testsdkext: skipped 'perl: No perl package in the SDK' core-image-minimal-1.0-r0 do_testsdkext: skipped 'python: No python package in the SDK' core-image-minimal-1.0-r0 do_testsdkext: core-image-minimal-1.0-r0 do_testsdkext: ====================================================================== core-image-minimal-1.0-r0 do_testsdkext: FAIL: test_cvs (oeqa.sdk.buildcvs.BuildCvsTest) core-image-minimal-1.0-r0 do_testsdkext: ---------------------------------------------------------------------- core-image-minimal-1.0-r0 do_testsdkext: Traceback (most recent call last): core-image-minimal-1.0-r0 do_testsdkext: Traceback (most recent call last): File "/buildarea/lyang1/poky/meta/lib/oeqa/sdk/buildcvs.py", line 15, in test_cvs msg="Running configure failed") AssertionError: 77 != 0 : Running configure failed core-image-minimal-1.0-r0 do_testsdkext: core-image-minimal-1.0-r0 do_testsdkext: ====================================================================== core-image-minimal-1.0-r0 do_testsdkext: FAIL: test_iptables (oeqa.sdk.buildiptables.BuildIptablesTest) core-image-minimal-1.0-r0 do_testsdkext: ---------------------------------------------------------------------- core-image-minimal-1.0-r0 do_testsdkext: Traceback (most recent call last): File "/buildarea/lyang1/poky/meta/lib/oeqa/sdk/buildiptables.py", line 16, in test_iptables msg="Running configure failed") AssertionError: 77 != 0 : Running configure failed core-image-minimal-1.0-r0 do_testsdkext: core-image-minimal-1.0-r0 do_testsdkext: ---------------------------------------------------------------------- core-image-minimal-1.0-r0 do_testsdkext: Ran 2 tests in 6.425s core-image-minimal-1.0-r0 do_testsdkext: core-image-minimal-1.0-r0 do_testsdkext: FAILED (failures=2, skipped=4) ERROR: core-image-minimal-1.0-r0 do_testsdkext: core-image-minimal - FAILED - check the task log and the commands log ERROR: core-image-minimal-1.0-r0 do_testsdkext: Function failed: do_testsdkext