Bug 11641

Summary: test_integrity_compressed_images oe-selftest failed
Product: [Build System, Metadata & Runtime] OE-Core Reporter: Todor Minchev <todor.minchev>
Component: coreAssignee: Ross Burton <ross.burton>
Status: RESOLVED OBSOLETE QA Contact:
Severity: normal    
Priority: Undecided CC: meta.mr.watcher, meta.watcher
Version: 2.4   
Target Milestone: ---   
Hardware: x86   
OS: Multiple   
Whiteboard:
OS type for building Yocto: --- Type of Regression: ---
Verified: Documentation change: No (bug/feature does not impact docs)

Description Todor Minchev 2017-06-09 16:27:51 UTC
https://autobuilder.yoctoproject.org/main/builders/nightly-oe-selftest/builds/911/steps/Running%20oe-selftest/logs/stdio

2017-06-08 09:22:49,268 - oe-selftest - INFO - ======================================================================
2017-06-08 09:22:49,268 - oe-selftest - INFO - FAIL [124.260s]: test_integrity_compressed_images (runtime_test.GeneratedImages)
2017-06-08 09:22:49,268 - oe-selftest - INFO - ----------------------------------------------------------------------
2017-06-08 09:22:49,268 - oe-selftest - INFO - Traceback (most recent call last):
  File "/home/pokybuild/yocto-autobuilder/yocto-worker/nightly-oe-selftest/build/meta/lib/oeqa/core/decorator/__init__.py", line 32, in wrapped_f
    return func(*args, **kwargs)
  File "/home/pokybuild/yocto-autobuilder/yocto-worker/nightly-oe-selftest/build/meta/lib/oeqa/selftest/cases/runtime_test.py", line 277, in test_integrity_compressed_images
    bitbake(build)
  File "/home/pokybuild/yocto-autobuilder/yocto-worker/nightly-oe-selftest/build/meta/lib/oeqa/utils/commands.py", line 150, in bitbake
    return runCmd(cmd, ignore_status, timeout, **options)
  File "/home/pokybuild/yocto-autobuilder/yocto-worker/nightly-oe-selftest/build/meta/lib/oeqa/utils/commands.py", line 128, in runCmd
    raise AssertionError("Command '%s' returned non-zero exit status %d:\n%s" % (command, result.status, exc_output))
AssertionError: Command 'bitbake  core-image-minimal' returned non-zero exit status 1:
Parsing recipes...done.
Comment 1 Ross Burton 2017-06-09 16:33:27 UTC
Already yanked from MUT.