Bug 12069

Summary: [morty] ppc lsb neard failed to build
Product: [Build System, Metadata & Runtime] OE-Core Reporter: Armin Kuster <akuster>
Component: coreAssignee: Armin Kuster <akuster>
Status: RESOLVED FIXED QA Contact:
Severity: normal    
Priority: Undecided CC: meta.mr.watcher, meta.watcher, richard.purdie
Version: 2.2.2   
Target Milestone: ---   
Hardware: x86   
OS: Multiple   
URL: https://autobuilder.yocto.io/builders/nightly-ppc-lsb/builds/467/steps/BuildImages/logs/stdio
Whiteboard:
OS type for building Yocto: --- Type of Regression: Regression (Used to work)
Verified: Documentation change: Don't know

Description Armin Kuster 2017-09-08 21:32:02 UTC
| /usr/bin/mkdir -p src/ && sed -e 's,@pkglibexecdir\@,/usr/libexec/nfc,g' < ../neard-0.16/src/neard.service.in > src/neard.service
| powerpc-poky-linux-gcc  -m32 -mhard-float -mcpu=7400 -mno-spe --sysroot=/home/pokybuild/yocto-autobuilder/yocto-worker/nightly-ppc-lsb/build/build/tmp/sysroots/qemuppc -DHAVE_CONFIG_H -I. -I../neard-0.16  -I/home/pokybuild/yocto-autobuilder/yocto-worker/nightly-ppc-lsb/build/build/tmp/sysroots/qemuppc/usr/include/glib-2.0 -I/home/pokybuild/yocto-autobuilder/yocto-worker/nightly-ppc-lsb/build/build/tmp/sysroots/qemuppc/usr/lib/glib-2.0/include -I/home/pokybuild/yocto-autobuilder/yocto-worker/nightly-ppc-lsb/build/build/tmp/sysroots/qemuppc/usr/include/dbus-1.0 -I/home/pokybuild/yocto-autobuilder/yocto-worker/nightly-ppc-lsb/build/build/tmp/sysroots/qemuppc/usr/lib/dbus-1.0/include -I/home/pokybuild/yocto-autobuilder/yocto-worker/nightly-ppc-lsb/build/build/tmp/sysroots/qemuppc/usr/include/libnl3 -DNEAR_PLUGIN_BUILTIN -DPLUGINDIR=\""/usr/lib/neard/plugins"\" -DCONFIGDIR=\""/etc/neard\"" -I./include -I./src -I../neard-0.16/gdbus -I../neard-0.16/src   -I./include -I./src -I../neard-0.16/gdbus -O2 -pipe -g -feliminate-unused-debug-types -fdebug-prefix-map=/home/pokybuild/yocto-autobuilder/yocto-worker/nightly-ppc-lsb/build/build/tmp/work/ppc7400-poky-linux/neard/0.16-r0=/usr/src/debug/neard/0.16-r0 -fdebug-prefix-map=/home/pokybuild/yocto-autobuilder/yocto-worker/nightly-ppc-lsb/build/build/tmp/sysroots/x86_64-linux= -fdebug-prefix-map=/home/pokybuild/yocto-autobuilder/yocto-worker/nightly-ppc-lsb/build/build/tmp/sysroots/qemuppc=  -fstack-protector-strong -D_FORTIFY_SOURCE=2 -c -o tools/nciattach.o ../neard-0.16/tools/nciattach.c
| In file included from ../neard-0.16/tools/nciattach.c:47:0:
| ../neard-0.16/src/near.h:30:27: fatal error: near/nfc_copy.h: No such file or directory
|  #include <near/nfc_copy.h>
|                            ^
| compilation terminated.
| Makefile:1502: recipe for target 'tools/nciattach.o' failed
| make[1]: *** [tools/nciattach.o] Error 1
| make[1]: *** Waiting for unfinished jobs....
| Makefile:892: recipe for target 'all' failed
| make: *** [all] Error 2
Comment 1 Armin Kuster 2017-09-08 21:32:50 UTC
possible fix

https://patchwork.openembedded.org/patch/138215/