| Summary: | master-next] Build perf failed do to debianutils failing | ||
|---|---|---|---|
| Product: | [Build System, Metadata & Runtime] OE-Core | Reporter: | Armin Kuster <akuster> |
| Component: | core | Assignee: | Ross Burton <ross.burton> |
| Status: | RESOLVED OBSOLETE | QA Contact: | |
| Severity: | normal | ||
| Priority: | Undecided | CC: | meta.mr.watcher, meta.watcher, richard.purdie |
| Version: | 3.1 | ||
| Target Milestone: | --- | ||
| Hardware: | x86 | ||
| OS: | Multiple | ||
| Whiteboard: | |||
| OS type for building Yocto: | --- | Type of Regression: | --- |
| Verified: | Documentation change: | Don't know | |
master-next with the new debianutils which fails with older glibc. Already dropped from next. |
ERROR: test1 (oeqa.buildperf.test_basic.Test1P1) Build core-image-sato ---------------------------------------------------------------------- Traceback (most recent call last): File "/home/pokybuild/yocto-worker/buildperf-centos7/build/meta/lib/oeqa/buildperf/test_basic.py", line 23, in test1 'bitbake ' + self.build_target, save_bs=True) File "/home/pokybuild/yocto-worker/buildperf-centos7/build/meta/lib/oeqa/buildperf/base.py", line 346, in measure_cmd_resources raise data oeqa.utils.CommandError: Command '['bitbake', 'core-image-sato']' returned non-zero exit status 1 with output: ... (last 40 lines of output) | make[2]: Leaving directory '/home/pokybuild/build-perf-test/build-595706a9b0-20191207122955/tmp/work/x86_64-linux/debianutils-native/4.9-r0/build/po4a/sl' | make[2]: Entering directory '/home/pokybuild/build-perf-test/build-595706a9b0-20191207122955/tmp/work/x86_64-linux/debianutils-native/4.9-r0/build/po4a' | make[2]: Nothing to be done for 'all-am'. | make[2]: Leaving directory '/home/pokybuild/build-perf-test/build-595706a9b0-20191207122955/tmp/work/x86_64-linux/debianutils-native/4.9-r0/build/po4a' | make[1]: Leaving directory '/home/pokybuild/build-perf-test/build-595706a9b0-20191207122955/tmp/work/x86_64-linux/debianutils-native/4.9-r0/build/po4a' | make[1]: Entering directory '/home/pokybuild/build-perf-test/build-595706a9b0-20191207122955/tmp/work/x86_64-linux/debianutils-native/4.9-r0/build' | gcc -DPACKAGE_NAME=\"debianutils\" -DPACKAGE_TARNAME=\"debianutils\" -DPACKAGE_VERSION=\"4.8.6\" -DPACKAGE_STRING=\"debianutils\ 4.8.6\" -DPACKAGE_BUGREPORT=\"\" -DPACKAGE_URL=\"\" -DPACKAGE=\"debianutils\" -DVERSION=\"4.8.6\" -DSTDC_HEADERS=1 -DHAVE_SYS_TYPES_H=1 -DHAVE_SYS_STAT_H=1 -DHAVE_STDLIB_H=1 -DHAVE_STRING_H=1 -DHAVE_MEMORY_H=1 -DHAVE_STRINGS_H=1 -DHAVE_INTTYPES_H=1 -DHAVE_STDINT_H=1 -DHAVE_UNISTD_H=1 -DHAVE_PATHS_H=1 -DHAVE_GETOPT_H=1 -I. -I../debianutils-4.9 -isystem/home/pokybuild/build-perf-test/build-595706a9b0-20191207122955/tmp/work/x86_64-linux/debianutils-native/4.9-r0/recipe-sysroot-native/usr/include -isystem/home/pokybuild/build-perf-test/build-595706a9b0-20191207122955/tmp/work/x86_64-linux/debianutils-native/4.9-r0/recipe-sysroot-native/usr/include -O2 -pipe -c -o run-parts.o ../debianutils-4.9/run-parts.c | gcc -DPACKAGE_NAME=\"debianutils\" -DPACKAGE_TARNAME=\"debianutils\" -DPACKAGE_VERSION=\"4.8.6\" -DPACKAGE_STRING=\"debianutils\ 4.8.6\" -DPACKAGE_BUGREPORT=\"\" -DPACKAGE_URL=\"\" -DPACKAGE=\"debianutils\" -DVERSION=\"4.8.6\" -DSTDC_HEADERS=1 -DHAVE_SYS_TYPES_H=1 -DHAVE_SYS_STAT_H=1 -DHAVE_STDLIB_H=1 -DHAVE_STRING_H=1 -DHAVE_MEMORY_H=1 -DHAVE_STRINGS_H=1 -DHAVE_INTTYPES_H=1 -DHAVE_STDINT_H=1 -DHAVE_UNISTD_H=1 -DHAVE_PATHS_H=1 -DHAVE_GETOPT_H=1 -I. -I../debianutils-4.9 -isystem/home/pokybuild/build-perf-test/build-595706a9b0-20191207122955/tmp/work/x86_64-linux/debianutils-native/4.9-r0/recipe-sysroot-native/usr/include -isystem/home/pokybuild/build-perf-test/build-595706a9b0-20191207122955/tmp/work/x86_64-linux/debianutils-native/4.9-r0/recipe-sysroot-native/usr/include -O2 -pipe -c -o tempfile.o ../debianutils-4.9/tempfile.c | gcc -DPACKAGE_NAME=\"debianutils\" -DPACKAGE_TARNAME=\"debianutils\" -DPACKAGE_VERSION=\"4.8.6\" -DPACKAGE_STRING=\"debianutils\ 4.8.6\" -DPACKAGE_BUGREPORT=\"\" -DPACKAGE_URL=\"\" -DPACKAGE=\"debianutils\" -DVERSION=\"4.8.6\" -DSTDC_HEADERS=1 -DHAVE_SYS_TYPES_H=1 -DHAVE_SYS_STAT_H=1 -DHAVE_STDLIB_H=1 -DHAVE_STRING_H=1 -DHAVE_MEMORY_H=1 -DHAVE_STRINGS_H=1 -DHAVE_INTTYPES_H=1 -DHAVE_STDINT_H=1 -DHAVE_UNISTD_H=1 -DHAVE_PATHS_H=1 -DHAVE_GETOPT_H=1 -I. -I../debianutils-4.9 -isystem/home/pokybuild/build-perf-test/build-595706a9b0-20191207122955/tmp/work/x86_64-linux/debianutils-native/4.9-r0/recipe-sysroot-native/usr/include -isystem/home/pokybuild/build-perf-test/build-595706a9b0-20191207122955/tmp/work/x86_64-linux/debianutils-native/4.9-r0/recipe-sysroot-native/usr/include -O2 -pipe -c -o ischroot.o ../debianutils-4.9/ischroot.c | ../debianutils-4.9/run-parts.c: In function ‘copy_stdin’: | ../debianutils-4.9/run-parts.c:404:21: error: ‘O_TMPFILE’ undeclared (first use in this function) | fd = open(tmpdir, O_TMPFILE|O_RDWR|O_EXCL, S_IRUSR | S_IWUSR); | ^ | ../debianutils-4.9/run-parts.c:404:21: note: each undeclared identifier is reported only once for each function it appears in | make[1]: *** [Makefile:550: run-parts.o] Error 1 | make[1]: *** Waiting for unfinished jobs.... | make[1]: Leaving directory '/home/pokybuild/build-perf-test/build-595706a9b0-20191207122955/tmp/work/x86_64-linux/debianutils-native/4.9-r0/build' | make: *** [Makefile:652: all-recursive] Error 1 | WARNING: /home/pokybuild/build-perf-test/build-595706a9b0-20191207122955/tmp/work/x86_64-linux/debianutils-native/4.9-r0/temp/run.do_compile.8618:1 exit 1 from 'exit 1' |